Pretest Build Reports - Build 6228 details

For more information see

← back to list

Project: gawk-4.2.64-agn1
System: Oracle SunOS 5.11 (i86pc)
make failed
Download logs (what's inside?)
Last lines of tail-error.log:
make failed, tail of make.log:

mv -f .deps/readdir_test.Tpo .deps/readdir_test.Plo
/bin/sh ./libtool  --tag=CC   --mode=link gcc  -g -O2 -DNDEBUG -module -avoid-version -no-undefined -rpath /foo  -o  readdir_test.lo -lintl -lm
libtool: link: gcc -shared  -fPIC -DPIC -Wl,-z -Wl,text -Wl,-h -Wl, -o .libs/  .libs/readdir_test.o   -lintl -lm  -g -O2
libtool: link: ( cd ".libs" && rm -f "" && ln -s "../" "" )
/bin/sh ./libtool  --tag=CC   --mode=compile gcc -DHAVE_CONFIG_H -I.  -I./..   -g -O2 -DNDEBUG -MT testext.lo -MD -MP -MF .deps/testext.Tpo -c -o testext.lo testext.c
libtool: compile:  gcc -DHAVE_CONFIG_H -I. -I./.. -g -O2 -DNDEBUG -MT testext.lo -MD -MP -MF .deps/testext.Tpo -c testext.c  -fPIC -DPIC -o .libs/testext.o
mv -f .deps/testext.Tpo .deps/testext.Plo
/bin/sh ./libtool  --tag=CC   --mode=link gcc  -g -O2 -DNDEBUG -module -avoid-version -no-undefined -rpath /foo  -o  testext.lo -lintl -lm
libtool: link: gcc -shared  -fPIC -DPIC -Wl,-z -Wl,text -Wl,-h -Wl, -o .libs/  .libs/testext.o   -lintl -lm  -g -O2
libtool: link: ( cd ".libs" && rm -f "" && ln -s "../" "" )
/bin/sh ./libtool  --tag=CC   --mode=compile gcc -DHAVE_CONFIG_H -I.  -I./..   -g -O2 -DNDEBUG -MT filefuncs.lo -MD -MP -MF .deps/filefuncs.Tpo -c -o filefuncs.lo filefuncs.c
libtool: compile:  gcc -DHAVE_CONFIG_H -I. -I./.. -g -O2 -DNDEBUG -MT filefuncs.lo -MD -MP -MF .deps/filefuncs.Tpo -c filefuncs.c  -fPIC -DPIC -o .libs/filefuncs.o
mv -f .deps/filefuncs.Tpo .deps/filefuncs.Plo
/bin/sh ./libtool  --tag=CC   --mode=compile gcc -DHAVE_CONFIG_H -I.  -I./..   -g -O2 -DNDEBUG -MT stack.lo -MD -MP -MF .deps/stack.Tpo -c -o stack.lo stack.c
libtool: compile:  gcc -DHAVE_CONFIG_H -I. -I./.. -g -O2 -DNDEBUG -MT stack.lo -MD -MP -MF .deps/stack.Tpo -c stack.c  -fPIC -DPIC -o .libs/stack.o
mv -f .deps/stack.Tpo .deps/stack.Plo
/bin/sh ./libtool  --tag=CC   --mode=compile gcc -DHAVE_CONFIG_H -I.  -I./..   -g -O2 -DNDEBUG -MT gawkfts.lo -MD -MP -MF .deps/gawkfts.Tpo -c -o gawkfts.lo gawkfts.c
libtool: compile:  gcc -DHAVE_CONFIG_H -I. -I./.. -g -O2 -DNDEBUG -MT gawkfts.lo -MD -MP -MF .deps/gawkfts.Tpo -c gawkfts.c  -fPIC -DPIC -o .libs/gawkfts.o
mv -f .deps/gawkfts.Tpo .deps/gawkfts.Plo
/bin/sh ./libtool  --tag=CC   --mode=link gcc  -g -O2 -DNDEBUG -module -avoid-version -no-undefined  -o -rpath /usr/local/lib/gawk filefuncs.lo stack.lo gawkfts.lo -lintl -lm
libtool: link: gcc -shared  -fPIC -DPIC -Wl,-z -Wl,text -Wl,-h -Wl, -o .libs/  .libs/filefuncs.o .libs/stack.o .libs/gawkfts.o   -lintl -lm  -g -O2
libtool: link: ( cd ".libs" && rm -f "" && ln -s "../" "" )
/bin/sh ./libtool  --tag=CC   --mode=compile gcc -DHAVE_CONFIG_H -I.  -I./..   -g -O2 -DNDEBUG -MT fnmatch.lo -MD -MP -MF .deps/fnmatch.Tpo -c -o fnmatch.lo fnmatch.c
libtool: compile:  gcc -DHAVE_CONFIG_H -I. -I./.. -g -O2 -DNDEBUG -MT fnmatch.lo -MD -MP -MF .deps/fnmatch.Tpo -c fnmatch.c  -fPIC -DPIC -o .libs/fnmatch.o
mv -f .deps/fnmatch.Tpo .deps/fnmatch.Plo
/bin/sh ./libtool  --tag=CC   --mode=link gcc  -g -O2 -DNDEBUG -module -avoid-version -no-undefined  -o -rpath /usr/local/lib/gawk fnmatch.lo -lintl -lm
libtool: link: gcc -shared  -fPIC -DPIC -Wl,-z -Wl,text -Wl,-h -Wl, -o .libs/  .libs/fnmatch.o   -lintl -lm  -g -O2
libtool: link: ( cd ".libs" && rm -f "" && ln -s "../" "" )
/bin/sh ./libtool  --tag=CC   --mode=compile gcc -DHAVE_CONFIG_H -I.  -I./..   -g -O2 -DNDEBUG -MT fork.lo -MD -MP -MF .deps/fork.Tpo -c -o fork.lo fork.c
libtool: compile:  gcc -DHAVE_CONFIG_H -I. -I./.. -g -O2 -DNDEBUG -MT fork.lo -MD -MP -MF .deps/fork.Tpo -c fork.c  -fPIC -DPIC -o .libs/fork.o
mv -f .deps/fork.Tpo .deps/fork.Plo
/bin/sh ./libtool  --tag=CC   --mode=link gcc  -g -O2 -DNDEBUG -module -avoid-version -no-undefined  -o -rpath /usr/local/lib/gawk fork.lo -lintl -lm
libtool: link: gcc -shared  -fPIC -DPIC -Wl,-z -Wl,text -Wl,-h -Wl, -o .libs/  .libs/fork.o   -lintl -lm  -g -O2
libtool: link: ( cd ".libs" && rm -f "" && ln -s "../" "" )
/bin/sh ./libtool  --tag=CC   --mode=compile gcc -DHAVE_CONFIG_H -I.  -I./..   -g -O2 -DNDEBUG -MT inplace.lo -MD -MP -MF .deps/inplace.Tpo -c -o inplace.lo inplace.c
libtool: compile:  gcc -DHAVE_CONFIG_H -I. -I./.. -g -O2 -DNDEBUG -MT inplace.lo -MD -MP -MF .deps/inplace.Tpo -c inplace.c  -fPIC -DPIC -o .libs/inplace.o
In file included from /opt/csw/lib/gcc/i386-pc-solaris2.10/5.5.0/include-fixed/stdio.h:30:0,
from inplace.c:37:
/opt/csw/lib/gcc/i386-pc-solaris2.10/5.5.0/include-fixed/sys/feature_tests.h:346:2: error: #error "Compiler or options invalid for pre-UNIX 03 X/Open applications 	and pre-2001 POSIX applications"
#error "Compiler or options invalid for pre-UNIX 03 X/Open applications \
make[4]: *** [inplace.lo] Error 1
make[4]: Leaving directory `/home/agn/pretest.2019-03-18.Lra4UD/unstable11x/gawk-4.2.64-agn1.xbRUmW/gawk-4.2.64-agn1/extension'
make[3]: *** [all-recursive] Error 1
make[3]: Leaving directory `/home/agn/pretest.2019-03-18.Lra4UD/unstable11x/gawk-4.2.64-agn1.xbRUmW/gawk-4.2.64-agn1/extension'
make[2]: *** [all] Error 2
make[2]: Leaving directory `/home/agn/pretest.2019-03-18.Lra4UD/unstable11x/gawk-4.2.64-agn1.xbRUmW/gawk-4.2.64-agn1/extension'
make[1]: *** [all-recursive] Error 1
make[1]: Leaving directory `/home/agn/pretest.2019-03-18.Lra4UD/unstable11x/gawk-4.2.64-agn1.xbRUmW/gawk-4.2.64-agn1'
make: *** [all] Error 2

Build information

PATH /usr/gnu/bin:/usr/xpg6/bin:/usr/xpg4/bin/:/opt/csw/bin:usr/sfw/bin:/usr/bin:/bin
SHELL /opt/csw/bin/bash
PWD /home/agn/pretest.2019-03-18.Lra4UD/unstable11x/gawk-4.2.64-agn1.xbRUmW
hostname unstable11x
BASENAME gawk-4.2.64-agn1
make_check_extra_params SUBDIRS=.

Build host information

autoconf-version autoconf (GNU Autoconf) 2.69
automake-version automake (GNU automake) 1.15.1
autopoint-version /usr/bin/autopoint (GNU gettext-tools) 0.16.1
autoreconf-version autoreconf (GNU Autoconf) 2.69
make-version GNU Make 3.82
makeinfo-version texi2any (GNU texinfo) 6.1
git-version git version 2.4.0
wget-version GNU Wget 1.19.4 built on solaris2.10.
rsync-version rsync version 3.1.2 protocol version 31
gcc-version gcc (GCC) 5.5.0
cc-version missing
uname-s SunOS
uname-r 5.11
uname-m i86pc
uname-p i386
uname-i i86pc
uname-o Solaris
uname-v 11.3
etc_release Oracle Solaris 11.3 X86

Download Log Files

logs/status 12 Bytes curl -JLO ''
logs/timestamp.start.txt 76 Bytes curl -JLO ''
logs/config.status 43.9 kB curl -JLO ''
logs/configure.log 16.7 kB curl -JLO ''
logs/input.txt 198 Bytes curl -JLO ''
logs/config.h 14.3 kB curl -JLO ''
logs/tail-error.log 5.7 kB curl -JLO ''
logs/configure.ok 0 Bytes curl -JLO ''
logs/config.log 155.1 kB curl -JLO ''
logs/environment.txt 207 Bytes curl -JLO ''
logs/make.log 16.3 kB curl -JLO ''
logs/versions.txt 702 Bytes curl -JLO ''