Pretest Build Reports - Build 6224 details

For more information see http://pretest.nongnu.org.

← back to list

Project: gawk-4.2.64
Source: http://www.skeeve.com/gawk/gawk-4.2.64.tar.gz
System: Debian 8.11 (mips64)
Status:
make-check failed
Download logs (what's inside?) gawk-4.2.64.pretest-build-report.build-6224.tar.bz2
Last lines of tail-error.log:
make-check failed, tail of make-check.log:

mpfrsqrt
mpfrstrtonum
mpgforcenum
mpfruplus
make[2]: Leaving directory '/home/agn/tmp/pretest.2019-03-15.fvgdGk/gawk-4.2.64.BobIvx/gawk-4.2.64/test'
======== Done with MPFR tests ========
make[2]: Entering directory '/home/agn/tmp/pretest.2019-03-15.fvgdGk/gawk-4.2.64.BobIvx/gawk-4.2.64/test'
3 TESTS FAILED
Makefile:4932: recipe for target 'pass-fail' failed
make[2]: *** [pass-fail] Error 1
make[2]: Leaving directory '/home/agn/tmp/pretest.2019-03-15.fvgdGk/gawk-4.2.64.BobIvx/gawk-4.2.64/test'
make[2]: Entering directory '/home/agn/tmp/pretest.2019-03-15.fvgdGk/gawk-4.2.64.BobIvx/gawk-4.2.64/test'
for i in _* ; \
do  \
if [ "$i" != "_*" ]; then \
echo ============== $i ============= ; \
base=`echo $i | sed 's/^_//'` ; \
if [ -r ${base}.ok ]; then \
diff -c ${base}.ok $i ; \
else \
diff -c "."/${base}.ok  $i ; \
fi ; \
fi ; \
done | more
diff: ./dirlist.ok: No such file or directory
diff: ./longlist.ok: No such file or directory
============== _dirlist =============
============== _longlist =============
============== _readdir =============
*** readdir.ok	2019-03-15 20:30:20.702009853 +0100
--- _readdir	2019-03-15 20:30:20.554006114 +0100
***************
*** 1,5 ****
! 44198683/./d
! 44122894/../d
44198771/symbol.c/f
44198826/io.o/f
44198737/ylwrap/f
--- 1,5 ----
! 44198683/./u
! 44122894/../u
44198771/symbol.c/f
44198826/io.o/f
44198737/ylwrap/f
make[2]: Leaving directory '/home/agn/tmp/pretest.2019-03-15.fvgdGk/gawk-4.2.64.BobIvx/gawk-4.2.64/test'
Makefile:1961: recipe for target 'check' failed
make[1]: *** [check] Error 1
make[1]: Leaving directory '/home/agn/tmp/pretest.2019-03-15.fvgdGk/gawk-4.2.64.BobIvx/gawk-4.2.64/test'
Makefile:744: recipe for target 'check-recursive' failed
make: *** [check-recursive] Error 1

Build information

PATH /usr/local/bin:/usr/bin:/bin:/usr/games
SHELL /bin/bash
PWD /home/agn/tmp/pretest.2019-03-15.fvgdGk/gawk-4.2.64.BobIvx
hostname erpro8-fsf2
SOURCE http://www.skeeve.com/gawk/gawk-4.2.64.tar.gz
BASENAME gawk-4.2.64
configure_extra_params
make_extra_params
make_check_extra_params
env_extra_params
git_branch

Build host information

autoconf-version autoconf (GNU Autoconf) 2.69
automake-version automake (GNU automake) 1.14.1
autopoint-version missing
autoreconf-version autoreconf (GNU Autoconf) 2.69
make-version GNU Make 4.0
makeinfo-version makeinfo (GNU texinfo) 5.2
git-version git version 2.1.4
wget-version GNU Wget 1.16 built on linux-gnu.
rsync-version rsync version 3.1.1 protocol version 31
gcc-version gcc (Debian 4.9.2-10+deb8u1) 4.9.2
cc-version cc (Debian 4.9.2-10+deb8u1) 4.9.2
uname-s Linux
uname-r 4.1.4
uname-m mips64
uname-p unknown
uname-i unknown
uname-o GNU/Linux
uname-v #1 SMP PREEMPT Mon Aug 3 14:22:54 PDT 2015
lsb_release-v
lsb_release-i Debian
lsb_release-d Debian GNU/Linux 8.11 (jessie)
lsb_release-r 8.11
lsb_release-c jessie
etc_release
etc_issue Debian GNU/Linux 8 \n \l
etc_os_release_PRETTY_NAME Debian GNU/Linux 8 (jessie)
etc_os_release_NAME Debian GNU/Linux
etc_os_release_VERSION_ID 8
etc_os_release_VERSION 8 (jessie)
etc_os_release_ID debian
etc_os_release_HOME_URL http://www.debian.org/
etc_os_release_SUPPORT_URL http://www.debian.org/support
etc_os_release_BUG_REPORT_URL https://bugs.debian.org/

Download Log Files

logs/config.status 43.8 kB curl -JLO 'http://pretest.housegordon.org/g/6224/logs/config.status'
logs/timestamp.start.txt 76 Bytes curl -JLO 'http://pretest.housegordon.org/g/6224/logs/timestamp.start.txt'
logs/versions.txt 1.1 kB curl -JLO 'http://pretest.housegordon.org/g/6224/logs/versions.txt'
logs/config.h 14.3 kB curl -JLO 'http://pretest.housegordon.org/g/6224/logs/config.h'
logs/input.txt 172 Bytes curl -JLO 'http://pretest.housegordon.org/g/6224/logs/input.txt'
logs/status 18 Bytes curl -JLO 'http://pretest.housegordon.org/g/6224/logs/status'
logs/make.log 24.0 kB curl -JLO 'http://pretest.housegordon.org/g/6224/logs/make.log'
logs/config.log 112.9 kB curl -JLO 'http://pretest.housegordon.org/g/6224/logs/config.log'
logs/configure.ok 0 Bytes curl -JLO 'http://pretest.housegordon.org/g/6224/logs/configure.ok'
logs/environment.txt 145 Bytes curl -JLO 'http://pretest.housegordon.org/g/6224/logs/environment.txt'
logs/tail-error.log 1.8 kB curl -JLO 'http://pretest.housegordon.org/g/6224/logs/tail-error.log'
logs/make-check.log 10.4 kB curl -JLO 'http://pretest.housegordon.org/g/6224/logs/make-check.log'
logs/configure.log 16.0 kB curl -JLO 'http://pretest.housegordon.org/g/6224/logs/configure.log'
logs/make.ok 0 Bytes curl -JLO 'http://pretest.housegordon.org/g/6224/logs/make.ok'