Pretest Build Reports - Build 6212 details

For more information see http://pretest.nongnu.org.

← back to list

Project: gawk-4.2.64
Source: http://www.skeeve.com/gawk/gawk-4.2.64.tar.gz
System: CYGWIN_NT-10.0 2.11.1(0.329/5/3) (x86_64, host=x86_64-w64-mingw32)
Status:
make failed
Download logs (what's inside?) gawk-4.2.64.pretest-build-report.build-6212.tar.bz2
Last lines of tail-error.log:
make failed, tail of make.log:

make 'CFLAGS=-g -O2 -DNDEBUG' 'LDFLAGS=' all-recursive
make[1]: Entering directory '/home/admin/pretest.2019-03-15.4XCTQj/gawk-4.2.64.QJDkYz/gawk-4.2.64'
Making all in support
make[2]: Entering directory '/home/admin/pretest.2019-03-15.4XCTQj/gawk-4.2.64.QJDkYz/gawk-4.2.64/support'
x86_64-w64-mingw32-gcc -DGAWK -DHAVE_CONFIG_H -I"./.." -I. -I..     -g -O2 -DNDEBUG -MT dfa.o -MD -MP -MF .deps/dfa.Tpo -c -o dfa.o dfa.c
mv -f .deps/dfa.Tpo .deps/dfa.Po
x86_64-w64-mingw32-gcc -DGAWK -DHAVE_CONFIG_H -I"./.." -I. -I..     -g -O2 -DNDEBUG -MT getopt.o -MD -MP -MF .deps/getopt.Tpo -c -o getopt.o getopt.c
mv -f .deps/getopt.Tpo .deps/getopt.Po
x86_64-w64-mingw32-gcc -DGAWK -DHAVE_CONFIG_H -I"./.." -I. -I..     -g -O2 -DNDEBUG -MT getopt1.o -MD -MP -MF .deps/getopt1.Tpo -c -o getopt1.o getopt1.c
mv -f .deps/getopt1.Tpo .deps/getopt1.Po
x86_64-w64-mingw32-gcc -DGAWK -DHAVE_CONFIG_H -I"./.." -I. -I..     -g -O2 -DNDEBUG -MT localeinfo.o -MD -MP -MF .deps/localeinfo.Tpo -c -o localeinfo.o localeinfo.c
mv -f .deps/localeinfo.Tpo .deps/localeinfo.Po
x86_64-w64-mingw32-gcc -DGAWK -DHAVE_CONFIG_H -I"./.." -I. -I..     -g -O2 -DNDEBUG -MT random.o -MD -MP -MF .deps/random.Tpo -c -o random.o random.c
mv -f .deps/random.Tpo .deps/random.Po
x86_64-w64-mingw32-gcc -DGAWK -DHAVE_CONFIG_H -I"./.." -I. -I..     -g -O2 -DNDEBUG -MT regex.o -MD -MP -MF .deps/regex.Tpo -c -o regex.o regex.c
In file included from regex.c:68:0:
regex_internal.h:29:22: fatal error: langinfo.h: No such file or directory
#include <langinfo.h>
^
compilation terminated.
make[2]: *** [Makefile:437: regex.o] Error 1
make[2]: Leaving directory '/home/admin/pretest.2019-03-15.4XCTQj/gawk-4.2.64.QJDkYz/gawk-4.2.64/support'
make[1]: *** [Makefile:744: all-recursive] Error 1
make[1]: Leaving directory '/home/admin/pretest.2019-03-15.4XCTQj/gawk-4.2.64.QJDkYz/gawk-4.2.64'
make: *** [Makefile:563: all] Error 2

Build information

PATH /bin:/cygdrive/c/ProgramData/Oracle/Java/javapath:/cygdrive/c/Program Files (x86)/HP SimplePass 2011/x64:/cygdrive/c/Program Files (x86)/HP SimplePass 2011:/cygdrive/c/WINDOWS/system32:/cygdrive/c/WINDOWS:/cygdrive/c/WINDOWS/System32/Wbem:/cygdrive/c/WINDOWS/System32/WindowsPowerShell/v1.0:/cygdrive/c/Program Files (x86)/QuickTime/QTSystem:/cygdrive/c/Program Files/Git/cmd:/cygdrive/c/Program Files/PuTTY:/cygdrive/c/WINDOWS/System32/OpenSSH:/cygdrive/c/WINDOWS/system32/config/systemprofile/AppData/Local/Microsoft/WindowsApps
SHELL /bin/bash
PWD /home/admin/pretest.2019-03-15.4XCTQj/gawk-4.2.64.QJDkYz
hostname Anne-HP
SOURCE http://www.skeeve.com/gawk/gawk-4.2.64.tar.gz
BASENAME gawk-4.2.64
configure_extra_params --host=x86_64-w64-mingw32 --disable-nls
make_extra_params
make_check_extra_params
env_extra_params
git_branch

Build host information

autoconf-version autoconf (GNU Autoconf) 2.69
automake-version automake (GNU automake) 1.15.1
autopoint-version missing
autoreconf-version autoreconf (GNU Autoconf) 2.69
make-version GNU Make 4.2.1
makeinfo-version texi2any (GNU texinfo) 6.5
git-version git version 2.17.0
wget-version GNU Wget 1.19.1 built on cygwin.
rsync-version rsync version 3.1.2 protocol version 31
gcc-version gcc (GCC) 7.3.0
cc-version cc (GCC) 7.3.0
uname-s CYGWIN_NT-10.0
uname-r 2.11.1(0.329/5/3)
uname-m x86_64
uname-p unknown
uname-i unknown
uname-o Cygwin
uname-v 2018-09-05 10:24
lsb_release-v
lsb_release-i
lsb_release-d
lsb_release-r
lsb_release-c
etc_release
etc_issue

Download Log Files

logs/config.h 14.4 kB curl -JLO 'http://pretest.housegordon.org/g/6212/logs/config.h'
logs/config.log 266.6 kB curl -JLO 'http://pretest.housegordon.org/g/6212/logs/config.log'
logs/config.status 42.9 kB curl -JLO 'http://pretest.housegordon.org/g/6212/logs/config.status'
logs/configure.log 9.3 kB curl -JLO 'http://pretest.housegordon.org/g/6212/logs/configure.log'
logs/configure.ok 0 Bytes curl -JLO 'http://pretest.housegordon.org/g/6212/logs/configure.ok'
logs/environment.txt 630 Bytes curl -JLO 'http://pretest.housegordon.org/g/6212/logs/environment.txt'
logs/input.txt 212 Bytes curl -JLO 'http://pretest.housegordon.org/g/6212/logs/input.txt'
logs/make.log 1.9 kB curl -JLO 'http://pretest.housegordon.org/g/6212/logs/make.log'
logs/status 12 Bytes curl -JLO 'http://pretest.housegordon.org/g/6212/logs/status'
logs/tail-error.log 1.9 kB curl -JLO 'http://pretest.housegordon.org/g/6212/logs/tail-error.log'
logs/timestamp.start.txt 76 Bytes curl -JLO 'http://pretest.housegordon.org/g/6212/logs/timestamp.start.txt'
logs/versions.txt 684 Bytes curl -JLO 'http://pretest.housegordon.org/g/6212/logs/versions.txt'