Pretest Build Reports - Build 6207 details

For more information see http://pretest.nongnu.org.

← back to list

Project: gawk-4.2.64
Source: http://www.skeeve.com/gawk/gawk-4.2.64.tar.gz
System: CYGWIN_NT-10.0 2.11.1(0.329/5/3) (x86_64)
Status:
make-check failed
Download logs (what's inside?) gawk-4.2.64.pretest-build-report.build-6207.tar.bz2
Last lines of tail-error.log:
make-check failed, tail of make-check.log:

testext
time
make[2]: Leaving directory '/home/admin/pretest.2019-03-15.4XCTQj/gawk-4.2.64.bSIrOa/gawk-4.2.64/test'
======== Done with shared library tests ========
======== Starting MPFR tests ========
MPFR tests not supported on this system
======== Done with MPFR tests ========
make[2]: Entering directory '/home/admin/pretest.2019-03-15.4XCTQj/gawk-4.2.64.bSIrOa/gawk-4.2.64/test'
2 TESTS FAILED
make[2]: *** [Makefile:4932: pass-fail] Error 1
make[2]: Leaving directory '/home/admin/pretest.2019-03-15.4XCTQj/gawk-4.2.64.bSIrOa/gawk-4.2.64/test'
make[2]: Entering directory '/home/admin/pretest.2019-03-15.4XCTQj/gawk-4.2.64.bSIrOa/gawk-4.2.64/test'
for i in _* ; \
do  \
if [ "$i" != "_*" ]; then \
echo ============== $i ============= ; \
base=`echo $i | sed 's/^_//'` ; \
if [ -r ${base}.ok ]; then \
diff -c ${base}.ok $i ; \
else \
diff -c "."/${base}.ok  $i ; \
fi ; \
fi ; \
done | more
============== _pty1 =============
*** pty1.ok	Thu Dec 14 10:53:45 2017
--- _pty1	Fri Mar 15 12:45:04 2019
***************
*** 1,2 ****
! 123
! x is abc
--- 1,4 ----
! sh: line 0: echo: write error: Input/output error
! sh: line 0: echo: write error: Input/output error
!
!
============== _pty2 =============
*** pty2.ok	Mon Feb  4 12:13:48 2019
--- _pty2	Fri Mar 15 12:45:04 2019
***************
*** 1,2 ****
! 0000000 a b c d \n
! 0000005
--- 1,2 ----
! 0000000 \n
! 0000001
make[2]: Leaving directory '/home/admin/pretest.2019-03-15.4XCTQj/gawk-4.2.64.bSIrOa/gawk-4.2.64/test'
make[1]: *** [Makefile:1961: check] Error 1
make[1]: Leaving directory '/home/admin/pretest.2019-03-15.4XCTQj/gawk-4.2.64.bSIrOa/gawk-4.2.64/test'
make: *** [Makefile:744: check-recursive] Error 1

Build information

PATH /bin:/cygdrive/c/ProgramData/Oracle/Java/javapath:/cygdrive/c/Program Files (x86)/HP SimplePass 2011/x64:/cygdrive/c/Program Files (x86)/HP SimplePass 2011:/cygdrive/c/WINDOWS/system32:/cygdrive/c/WINDOWS:/cygdrive/c/WINDOWS/System32/Wbem:/cygdrive/c/WINDOWS/System32/WindowsPowerShell/v1.0:/cygdrive/c/Program Files (x86)/QuickTime/QTSystem:/cygdrive/c/Program Files/Git/cmd:/cygdrive/c/Program Files/PuTTY:/cygdrive/c/WINDOWS/System32/OpenSSH:/cygdrive/c/WINDOWS/system32/config/systemprofile/AppData/Local/Microsoft/WindowsApps
SHELL /bin/bash
PWD /home/admin/pretest.2019-03-15.4XCTQj/gawk-4.2.64.bSIrOa
hostname Anne-HP
SOURCE http://www.skeeve.com/gawk/gawk-4.2.64.tar.gz
BASENAME gawk-4.2.64
configure_extra_params
make_extra_params
make_check_extra_params
env_extra_params
git_branch

Build host information

autoconf-version autoconf (GNU Autoconf) 2.69
automake-version automake (GNU automake) 1.15.1
autopoint-version missing
autoreconf-version autoreconf (GNU Autoconf) 2.69
make-version GNU Make 4.2.1
makeinfo-version texi2any (GNU texinfo) 6.5
git-version git version 2.17.0
wget-version GNU Wget 1.19.1 built on cygwin.
rsync-version rsync version 3.1.2 protocol version 31
gcc-version gcc (GCC) 7.3.0
cc-version cc (GCC) 7.3.0
uname-s CYGWIN_NT-10.0
uname-r 2.11.1(0.329/5/3)
uname-m x86_64
uname-p unknown
uname-i unknown
uname-o Cygwin
uname-v 2018-09-05 10:24
lsb_release-v
lsb_release-i
lsb_release-d
lsb_release-r
lsb_release-c
etc_release
etc_issue

Download Log Files

logs/config.h 14.4 kB curl -JLO 'http://pretest.housegordon.org/g/6207/logs/config.h'
logs/config.log 130.1 kB curl -JLO 'http://pretest.housegordon.org/g/6207/logs/config.log'
logs/config.status 43.3 kB curl -JLO 'http://pretest.housegordon.org/g/6207/logs/config.status'
logs/configure.log 16.1 kB curl -JLO 'http://pretest.housegordon.org/g/6207/logs/configure.log'
logs/configure.ok 0 Bytes curl -JLO 'http://pretest.housegordon.org/g/6207/logs/configure.ok'
logs/environment.txt 630 Bytes curl -JLO 'http://pretest.housegordon.org/g/6207/logs/environment.txt'
logs/input.txt 172 Bytes curl -JLO 'http://pretest.housegordon.org/g/6207/logs/input.txt'
logs/make-check.log 10.8 kB curl -JLO 'http://pretest.housegordon.org/g/6207/logs/make-check.log'
logs/make.log 24.1 kB curl -JLO 'http://pretest.housegordon.org/g/6207/logs/make.log'
logs/make.ok 0 Bytes curl -JLO 'http://pretest.housegordon.org/g/6207/logs/make.ok'
logs/status 18 Bytes curl -JLO 'http://pretest.housegordon.org/g/6207/logs/status'
logs/tail-error.log 1.7 kB curl -JLO 'http://pretest.housegordon.org/g/6207/logs/tail-error.log'
logs/timestamp.start.txt 76 Bytes curl -JLO 'http://pretest.housegordon.org/g/6207/logs/timestamp.start.txt'
logs/versions.txt 684 Bytes curl -JLO 'http://pretest.housegordon.org/g/6207/logs/versions.txt'