Pretest Build Reports - Build 6168 details

For more information see http://pretest.nongnu.org.

← back to list

Project: coreutils-8.30.87-66e2d
Source: http://agnx.s3.amazonaws.com/tmp/coreutils-8.30.87-66e2d.tar.xz
System: Darwin 17.4.0 (x86_64)
Status:
make-check failed
Download logs (what's inside?) coreutils-8.30.87-66e2d.pretest-build-report.build-6168.tar.bz2
Failed tests from tests-suite-summary.log:
=========================================================
GNU coreutils 8.30.87-66e2d: ./tests/test-suite.log
=========================================================

# TOTAL: 616
# PASS:  442
# SKIP:  172
# XFAIL: 0
# FAIL:  2
# XPASS: 0
# ERROR: 0

FAIL: tests/misc/wc-nbsp
========================

++initial_cwd_=/var/folders/nz/vv4_9tw56nv9k3tkvyszvwg80000gn/T/coreutils-8.30.87-66e2d.XXXXXX.gXdqVkVk/coreutils-8.30.87-66e2d
+++testdir_prefix_
+++printf gt
++pfx_=gt
+++mktempd_ /var/folders/nz/vv4_9tw56nv9k3tkvyszvwg80000gn/T/coreutils-8.30.87-66e2d.XXXXXX.gXdqVkVk/coreutils-8.30.87-66e2d gt-wc-nbsp.sh.XXXX
+++case $# in
+++destdir_=/var/folders/nz/vv4_9tw56nv9k3tkvyszvwg80000gn/T/coreutils-8.30.87-66e2d.XXXXXX.gXdqVkVk/coreutils-8.30.87-66e2d
+++template_=gt-wc-nbsp.sh.XXXX
+++MAX_TRIES_=4
+++case $destdir_ in
+++destdir_slash_=/var/folders/nz/vv4_9tw56nv9k3tkvyszvwg80000gn/T/coreutils-8.30.87-66e2d.XXXXXX.gXdqVkVk/coreutils-8.30.87-66e2d/
+++case $template_ in
++++unset TMPDIR
+++d=/var/folders/nz/vv4_9tw56nv9k3tkvyszvwg80000gn/T/coreutils-8.30.87-66e2d.XXXXXX.gXdqVkVk/coreutils-8.30.87-66e2d/gt-wc-nbsp.sh.vyHK
+++case $d in
+++:
+++test -d /var/folders/nz/vv4_9tw56nv9k3tkvyszvwg80000gn/T/coreutils-8.30.87-66e2d.XXXXXX.gXdqVkVk/coreutils-8.30.87-66e2d/gt-wc-nbsp.sh.vyHK
++++ls -dgo /var/folders/nz/vv4_9tw56nv9k3tkvyszvwg80000gn/T/coreutils-8.30.87-66e2d.XXXXXX.gXdqVkVk/coreutils-8.30.87-66e2d/gt-wc-nbsp.sh.vyHK
+++perms='drwx------ 2 68 Mar  7 11:30 /var/folders/nz/vv4_9tw56nv9k3tkvyszvwg80000gn/T/coreutils-8.30.87-66e2d.XXXXXX.gXdqVkVk/coreutils-8.30.87-66e2d/gt-wc-nbsp.sh.vyHK'
+++case $perms in
+++:
+++echo /var/folders/nz/vv4_9tw56nv9k3tkvyszvwg80000gn/T/coreutils-8.30.87-66e2d.XXXXXX.gXdqVkVk/coreutils-8.30.87-66e2d/gt-wc-nbsp.sh.vyHK
+++return
++test_dir_=/var/folders/nz/vv4_9tw56nv9k3tkvyszvwg80000gn/T/coreutils-8.30.87-66e2d.XXXXXX.gXdqVkVk/coreutils-8.30.87-66e2d/gt-wc-nbsp.sh.vyHK
++cd /var/folders/nz/vv4_9tw56nv9k3tkvyszvwg80000gn/T/coreutils-8.30.87-66e2d.XXXXXX.gXdqVkVk/coreutils-8.30.87-66e2d/gt-wc-nbsp.sh.vyHK
++gl_init_sh_nl_='
'
++IFS='
'
++for sig_ in 1 2 3 13 15
+++expr 1 + 128
++eval 'trap '\''Exit 129'\'' 1'
+++trap 'Exit 129' 1
++for sig_ in 1 2 3 13 15
+++expr 2 + 128
++eval 'trap '\''Exit 130'\'' 2'
+++trap 'Exit 130' 2
++for sig_ in 1 2 3 13 15
+++expr 3 + 128
++eval 'trap '\''Exit 131'\'' 3'
+++trap 'Exit 131' 3
++for sig_ in 1 2 3 13 15
+++expr 13 + 128
++eval 'trap '\''Exit 141'\'' 13'
+++trap 'Exit 141' 13
++for sig_ in 1 2 3 13 15
+++expr 15 + 128
++eval 'trap '\''Exit 143'\'' 15'
+++trap 'Exit 143' 15
++trap remove_tmp_ 0
+path_prepend_ ./src
+test 1 '!=' 0
+path_dir_=./src
+case $path_dir_ in
+abs_path_dir_=/var/folders/nz/vv4_9tw56nv9k3tkvyszvwg80000gn/T/coreutils-8.30.87-66e2d.XXXXXX.gXdqVkVk/coreutils-8.30.87-66e2d/./src
+case $abs_path_dir_ in
+PATH=/var/folders/nz/vv4_9tw56nv9k3tkvyszvwg80000gn/T/coreutils-8.30.87-66e2d.XXXXXX.gXdqVkVk/coreutils-8.30.87-66e2d/./src:/var/folders/nz/vv4_9tw56nv9k3tkvyszvwg80000gn/T/coreutils-8.30.87-66e2d.XXXXXX.gXdqVkVk/coreutils-8.30.87-66e2d/src:/Users/travis/.rvm/gems/ruby-2.4.3/bin:/Users/travis/.rvm/gems/ruby-2.4.3@global/bin:/Users/travis/.rvm/rubies/ruby-2.4.3/bin:/Users/travis/.rvm/bin:/Users/travis/.nvm/versions/node/v6.14.3/bin:/usr/local/bin:/usr/bin:/bin:/usr/sbin:/sbin:/opt/X11/bin
+create_exe_shims_ /var/folders/nz/vv4_9tw56nv9k3tkvyszvwg80000gn/T/coreutils-8.30.87-66e2d.XXXXXX.gXdqVkVk/coreutils-8.30.87-66e2d/./src
+case $EXEEXT in
+return 0
+shift
+test 0 '!=' 0
+export PATH
+print_ver_ wc printf
+require_built_ wc printf
+skip_=no
+for i in '"$@"'
+case " $built_programs " in
+for i in '"$@"'
+case " $built_programs " in
+test no = yes
+test yes = yes
+local i
+for i in '$*'
+env wc --version
wc (GNU coreutils) 8.30.87-66e2d
Copyright (C) 2019 Free Software Foundation, Inc.
License GPLv3+: GNU GPL version 3 or later <https://gnu.org/licenses/gpl.html>.
This is free software: you are free to change and redistribute it.
There is NO WARRANTY, to the extent permitted by law.

Written by Paul Rubin and David MacKenzie.
+for i in '$*'
+env printf --version
printf (GNU coreutils) 8.30.87-66e2d
Copyright (C) 2019 Free Software Foundation, Inc.
License GPLv3+: GNU GPL version 3 or later <https://gnu.org/licenses/gpl.html>.
This is free software: you are free to change and redistribute it.
There is NO WARRANTY, to the extent permitted by law.

Written by David MacKenzie.
+export LC_ALL=en_US.ISO-8859-1
+LC_ALL=en_US.ISO-8859-1
++locale charmap
+test US-ASCII = ISO-8859-1
+export LC_ALL=en_US.UTF-8
+LC_ALL=en_US.UTF-8
++locale charmap
+test UTF-8 = UTF-8
++env printf '=\u00A0='
++wc -L
+test 3 = 3
++env printf '=\u00A0='
++wc -w
+test 2 = 2
++env printf '=\u2007='
++wc -w
+test 2 = 2
++env printf '=\u202F='
++wc -w
+test 2 = 2
++env printf '=\u2060='
++wc -w
+test 1 = 2
+fail=1
+export LC_ALL=ru_RU.KOI8-R
+LC_ALL=ru_RU.KOI8-R
++locale charmap
+test KOI8-R = KOI8-R
++env printf '=\x9A='
++wc -L
+test 3 = 3
++env printf '=\x9A='
++wc -w
+test 2 = 2
+Exit 1
+set +e
+exit 1
+exit 1
+remove_tmp_
+__st=1
+cleanup_
+:
+test '' = yes
+cd /var/folders/nz/vv4_9tw56nv9k3tkvyszvwg80000gn/T/coreutils-8.30.87-66e2d.XXXXXX.gXdqVkVk/coreutils-8.30.87-66e2d
+chmod -R u+rwx /var/folders/nz/vv4_9tw56nv9k3tkvyszvwg80000gn/T/coreutils-8.30.87-66e2d.XXXXXX.gXdqVkVk/coreutils-8.30.87-66e2d/gt-wc-nbsp.sh.vyHK
+rm -rf /var/folders/nz/vv4_9tw56nv9k3tkvyszvwg80000gn/T/coreutils-8.30.87-66e2d.XXXXXX.gXdqVkVk/coreutils-8.30.87-66e2d/gt-wc-nbsp.sh.vyHK
+exit 1
FAIL tests/misc/wc-nbsp.sh (exit status: 1)

FAIL: tests/touch/trailing-slash
================================

++initial_cwd_=/var/folders/nz/vv4_9tw56nv9k3tkvyszvwg80000gn/T/coreutils-8.30.87-66e2d.XXXXXX.gXdqVkVk/coreutils-8.30.87-66e2d
+++testdir_prefix_
+++printf gt
++pfx_=gt
+++mktempd_ /var/folders/nz/vv4_9tw56nv9k3tkvyszvwg80000gn/T/coreutils-8.30.87-66e2d.XXXXXX.gXdqVkVk/coreutils-8.30.87-66e2d gt-trailing-slash.sh.XXXX
+++case $# in
+++destdir_=/var/folders/nz/vv4_9tw56nv9k3tkvyszvwg80000gn/T/coreutils-8.30.87-66e2d.XXXXXX.gXdqVkVk/coreutils-8.30.87-66e2d
+++template_=gt-trailing-slash.sh.XXXX
+++MAX_TRIES_=4
+++case $destdir_ in
+++destdir_slash_=/var/folders/nz/vv4_9tw56nv9k3tkvyszvwg80000gn/T/coreutils-8.30.87-66e2d.XXXXXX.gXdqVkVk/coreutils-8.30.87-66e2d/
+++case $template_ in
++++unset TMPDIR
+++d=/var/folders/nz/vv4_9tw56nv9k3tkvyszvwg80000gn/T/coreutils-8.30.87-66e2d.XXXXXX.gXdqVkVk/coreutils-8.30.87-66e2d/gt-trailing-slash.sh.zghS
+++case $d in
+++:
+++test -d /var/folders/nz/vv4_9tw56nv9k3tkvyszvwg80000gn/T/coreutils-8.30.87-66e2d.XXXXXX.gXdqVkVk/coreutils-8.30.87-66e2d/gt-trailing-slash.sh.zghS
++++ls -dgo /var/folders/nz/vv4_9tw56nv9k3tkvyszvwg80000gn/T/coreutils-8.30.87-66e2d.XXXXXX.gXdqVkVk/coreutils-8.30.87-66e2d/gt-trailing-slash.sh.zghS
+++perms='drwx------ 2 68 Mar  7 11:35 /var/folders/nz/vv4_9tw56nv9k3tkvyszvwg80000gn/T/coreutils-8.30.87-66e2d.XXXXXX.gXdqVkVk/coreutils-8.30.87-66e2d/gt-trailing-slash.sh.zghS'
+++case $perms in
+++:
+++echo /var/folders/nz/vv4_9tw56nv9k3tkvyszvwg80000gn/T/coreutils-8.30.87-66e2d.XXXXXX.gXdqVkVk/coreutils-8.30.87-66e2d/gt-trailing-slash.sh.zghS
+++return
++test_dir_=/var/folders/nz/vv4_9tw56nv9k3tkvyszvwg80000gn/T/coreutils-8.30.87-66e2d.XXXXXX.gXdqVkVk/coreutils-8.30.87-66e2d/gt-trailing-slash.sh.zghS
++cd /var/folders/nz/vv4_9tw56nv9k3tkvyszvwg80000gn/T/coreutils-8.30.87-66e2d.XXXXXX.gXdqVkVk/coreutils-8.30.87-66e2d/gt-trailing-slash.sh.zghS
++gl_init_sh_nl_='
'
++IFS='
'
++for sig_ in 1 2 3 13 15
+++expr 1 + 128
++eval 'trap '\''Exit 129'\'' 1'
+++trap 'Exit 129' 1
++for sig_ in 1 2 3 13 15
+++expr 2 + 128
++eval 'trap '\''Exit 130'\'' 2'
+++trap 'Exit 130' 2
++for sig_ in 1 2 3 13 15
+++expr 3 + 128
++eval 'trap '\''Exit 131'\'' 3'
+++trap 'Exit 131' 3
++for sig_ in 1 2 3 13 15
+++expr 13 + 128
++eval 'trap '\''Exit 141'\'' 13'
+++trap 'Exit 141' 13
++for sig_ in 1 2 3 13 15
+++expr 15 + 128
++eval 'trap '\''Exit 143'\'' 15'
+++trap 'Exit 143' 15
++trap remove_tmp_ 0
+path_prepend_ ./src
+test 1 '!=' 0
+path_dir_=./src
+case $path_dir_ in
+abs_path_dir_=/var/folders/nz/vv4_9tw56nv9k3tkvyszvwg80000gn/T/coreutils-8.30.87-66e2d.XXXXXX.gXdqVkVk/coreutils-8.30.87-66e2d/./src
+case $abs_path_dir_ in
+PATH=/var/folders/nz/vv4_9tw56nv9k3tkvyszvwg80000gn/T/coreutils-8.30.87-66e2d.XXXXXX.gXdqVkVk/coreutils-8.30.87-66e2d/./src:/var/folders/nz/vv4_9tw56nv9k3tkvyszvwg80000gn/T/coreutils-8.30.87-66e2d.XXXXXX.gXdqVkVk/coreutils-8.30.87-66e2d/src:/Users/travis/.rvm/gems/ruby-2.4.3/bin:/Users/travis/.rvm/gems/ruby-2.4.3@global/bin:/Users/travis/.rvm/rubies/ruby-2.4.3/bin:/Users/travis/.rvm/bin:/Users/travis/.nvm/versions/node/v6.14.3/bin:/usr/local/bin:/usr/bin:/bin:/usr/sbin:/sbin:/opt/X11/bin
+create_exe_shims_ /var/folders/nz/vv4_9tw56nv9k3tkvyszvwg80000gn/T/coreutils-8.30.87-66e2d.XXXXXX.gXdqVkVk/coreutils-8.30.87-66e2d/./src
+case $EXEEXT in
+return 0
+shift
+test 0 '!=' 0
+export PATH
+print_ver_ touch
+require_built_ touch
+skip_=no
+for i in '"$@"'
+case " $built_programs " in
+test no = yes
+test yes = yes
+local i
+for i in '$*'
+env touch --version
touch (GNU coreutils) 8.30.87-66e2d
Copyright (C) 2019 Free Software Foundation, Inc.
License GPLv3+: GNU GPL version 3 or later <https://gnu.org/licenses/gpl.html>.
This is free software: you are free to change and redistribute it.
There is NO WARRANTY, to the extent permitted by law.

Written by Paul Rubin, Arnold Robbins, Jim Kingdon,
David MacKenzie, and Randy Smith.
+ln -s nowhere dangling
+ln -s loop loop
+touch file
+ln -s file link1
+mkdir dir
+ln -s dir link2
+returns_ 1 touch no-file/
touch: setting times of 'no-file/': No such file or directory
+returns_ 1 touch file/
touch: setting times of 'file/': Not a directory
+returns_ 1 touch dangling/
touch: setting times of 'dangling/': No such file or directory
+returns_ 1 touch loop/
touch: setting times of 'loop/': Too many levels of symbolic links
+returns_ 1 touch link1/
+fail=1
+touch dir/
+touch -c no-file/
+returns_ 1 touch -c file/
touch: setting times of 'file/': Not a directory
+touch -c dangling/
+returns_ 1 touch -c loop/
touch: setting times of 'loop/': Too many levels of symbolic links
+returns_ 1 touch -c link1/
+fail=1
+touch -c dir/
+returns_ 1 test -f no-file
+returns_ 1 test -f nowhere
+touch -d 2009-10-10 -h link2/
+touch -h -r link2/ file
+case $(stat --format=%y dir) in
++stat --format=%y dir
+case $(stat --format=%y link2) in
++stat --format=%y link2
+case $(stat --format=%y file) in
++stat --format=%y file
+Exit 1
+set +e
+exit 1
+exit 1
+remove_tmp_
+__st=1
+cleanup_
+:
+test '' = yes
+cd /var/folders/nz/vv4_9tw56nv9k3tkvyszvwg80000gn/T/coreutils-8.30.87-66e2d.XXXXXX.gXdqVkVk/coreutils-8.30.87-66e2d
+chmod -R u+rwx /var/folders/nz/vv4_9tw56nv9k3tkvyszvwg80000gn/T/coreutils-8.30.87-66e2d.XXXXXX.gXdqVkVk/coreutils-8.30.87-66e2d/gt-trailing-slash.sh.zghS
+rm -rf /var/folders/nz/vv4_9tw56nv9k3tkvyszvwg80000gn/T/coreutils-8.30.87-66e2d.XXXXXX.gXdqVkVk/coreutils-8.30.87-66e2d/gt-trailing-slash.sh.zghS
+exit 1
FAIL tests/touch/trailing-slash.sh (exit status: 1)
Last lines of tail-error.log:
make-check failed, tail of make-check.log:


make check-very-expensive

+test 9 = 2
+printf '%s\n' 't36.sh: skipped test: very expensive: disabled by default
This test is very expensive, so it is disabled by default.
To run it anyway, rerun make check with the RUN_VERY_EXPENSIVE_TESTS
environment variable set to yes.  E.g.,

env RUN_VERY_EXPENSIVE_TESTS=yes make check

or use the shortcut target of the toplevel Makefile,

make check-very-expensive
'
+sed 1q
+Exit 77
+set +e
+exit 77
+exit 77
+remove_tmp_
+__st=77
+cleanup_
+:
+test '' = yes
+cd /var/folders/nz/vv4_9tw56nv9k3tkvyszvwg80000gn/T/coreutils-8.30.87-66e2d.XXXXXX.gXdqVkVk/coreutils-8.30.87-66e2d
+chmod -R u+rwx /var/folders/nz/vv4_9tw56nv9k3tkvyszvwg80000gn/T/coreutils-8.30.87-66e2d.XXXXXX.gXdqVkVk/coreutils-8.30.87-66e2d/gt-t36.sh.Ah2r
+rm -rf /var/folders/nz/vv4_9tw56nv9k3tkvyszvwg80000gn/T/coreutils-8.30.87-66e2d.XXXXXX.gXdqVkVk/coreutils-8.30.87-66e2d/gt-t36.sh.Ah2r
+exit 77
SKIP tests/factor/t36.sh (exit status: 77)

============================================================================
Testsuite summary for GNU coreutils 8.30.87-66e2d
============================================================================
# TOTAL: 616
# PASS:  442
# SKIP:  172
# XFAIL: 0
# FAIL:  2
# XPASS: 0
# ERROR: 0
============================================================================
See ./tests/test-suite.log
Please report to bug-coreutils@gnu.org
============================================================================
make[4]: *** [tests/test-suite.log] Error 1
make[3]: *** [check-TESTS] Error 2
make[2]: *** [check-am] Error 2
make[1]: *** [check-recursive] Error 1
make: *** [check] Error 2

Build information

PATH /Users/travis/.rvm/gems/ruby-2.4.3/bin:/Users/travis/.rvm/gems/ruby-2.4.3@global/bin:/Users/travis/.rvm/rubies/ruby-2.4.3/bin:/Users/travis/.rvm/bin:/Users/travis/bin:/Users/travis/.local/bin:/Users/travis/.nvm/versions/node/v6.14.3/bin:/usr/local/bin:/usr/bin:/bin:/usr/sbin:/sbin:/opt/X11/bin
SHELL /bin/bash
PWD /var/folders/nz/vv4_9tw56nv9k3tkvyszvwg80000gn/T/coreutils-8.30.87-66e2d.XXXXXX.gXdqVkVk
hostname Traviss-Mac-6.local
SOURCE http://agnx.s3.amazonaws.com/tmp/coreutils-8.30.87-66e2d.tar.xz
BASENAME coreutils-8.30.87-66e2d
configure_extra_params
make_extra_params
make_check_extra_params
env_extra_params
git_branch

Build host information

autoconf-version autoconf (GNU Autoconf) 2.69
automake-version automake (GNU automake) 1.16.1
autopoint-version missing
autoreconf-version autoreconf (GNU Autoconf) 2.69
make-version GNU Make 3.81
makeinfo-version makeinfo (GNU texinfo) 4.8
git-version git version 2.18.0
wget-version GNU Wget 1.19.5 built on darwin17.5.0.
rsync-version rsync version 2.6.9 protocol version 29
gcc-version Apple LLVM version 9.1.0 (clang-902.0.39.2)
cc-version Apple LLVM version 9.1.0 (clang-902.0.39.2)
uname-s Darwin
uname-r 17.4.0
uname-m x86_64
uname-p i386
uname-i
uname-o
uname-v Darwin Kernel Version 17.4.0: Sun Dec 17 09:19:54 PST 2017; root:xnu-4570.41.2~1/RELEASE_X86_64
lsb_release-v
lsb_release-i
lsb_release-d
lsb_release-r
lsb_release-c
etc_release
etc_issue

Download Log Files

logs/config.log 4.6 MB curl -JLO 'http://pretest.housegordon.org/g/6168/logs/config.log'
logs/config.status 105.5 kB curl -JLO 'http://pretest.housegordon.org/g/6168/logs/config.status'
logs/configure.log 46.8 kB curl -JLO 'http://pretest.housegordon.org/g/6168/logs/configure.log'
logs/configure.ok 0 Bytes curl -JLO 'http://pretest.housegordon.org/g/6168/logs/configure.ok'
logs/environment.txt 438 Bytes curl -JLO 'http://pretest.housegordon.org/g/6168/logs/environment.txt'
logs/input.txt 202 Bytes curl -JLO 'http://pretest.housegordon.org/g/6168/logs/input.txt'
logs/make-check.log 1.2 MB curl -JLO 'http://pretest.housegordon.org/g/6168/logs/make-check.log'
logs/make.log 29.2 kB curl -JLO 'http://pretest.housegordon.org/g/6168/logs/make.log'
logs/make.ok 0 Bytes curl -JLO 'http://pretest.housegordon.org/g/6168/logs/make.ok'
logs/status 18 Bytes curl -JLO 'http://pretest.housegordon.org/g/6168/logs/status'
logs/tail-error.log 1.7 kB curl -JLO 'http://pretest.housegordon.org/g/6168/logs/tail-error.log'
logs/test-suite.0.log 1.2 MB curl -JLO 'http://pretest.housegordon.org/g/6168/logs/test-suite.0.log'
logs/tests-suite-summary.log 11.1 kB curl -JLO 'http://pretest.housegordon.org/g/6168/logs/tests-suite-summary.log'
logs/timestamp.start.txt 76 Bytes curl -JLO 'http://pretest.housegordon.org/g/6168/logs/timestamp.start.txt'
logs/versions.txt 790 Bytes curl -JLO 'http://pretest.housegordon.org/g/6168/logs/versions.txt'