Pretest Build Reports - Build 6164 details

For more information see http://pretest.nongnu.org.

← back to list

Project: coreutils-8.30.87-66e2d
Source: http://agnx.s3.amazonaws.com/tmp/coreutils-8.30.87-66e2d.tar.xz
System: CYGWIN_NT-10.0 2.11.1(0.329/5/3) (x86_64)
Status:
make failed
Download logs (what's inside?) coreutils-8.30.87-66e2d.pretest-build-report.build-6164.tar.bz2
Last lines of tail-error.log:
make failed, tail of make.log:

CCLD     src/groups.exe
CC       src/head.o
CCLD     src/head.exe
CC       src/id.o
CCLD     src/id.exe
CC       src/join.o
CCLD     src/join.exe
CC       src/kill.o
CCLD     src/kill.exe
CC       src/link.o
CCLD     src/link.exe
CC       src/ln.o
CC       src/relpath.o
CCLD     src/ln.exe
CC       src/logname.o
CCLD     src/logname.exe
CC       src/ls-ls.o
CCLD     src/ls.exe
CC       src/src_md5sum-md5sum.o
CCLD     src/md5sum.exe
CC       src/mkdir.o
CC       src/prog-fprintf.o
CCLD     src/mkdir.exe
CC       src/mkfifo.o
CCLD     src/mkfifo.exe
CC       src/mknod.o
CCLD     src/mknod.exe
CC       src/mktemp.o
CCLD     src/mktemp.exe
CC       src/mv.o
CC       src/remove.o
CCLD     src/mv.exe
CC       src/nl.o
CCLD     src/nl.exe
CC       src/nproc.o
CCLD     src/nproc.exe
CC       src/nohup.o
CCLD     src/nohup.exe
CC       src/numfmt.o
CCLD     src/numfmt.exe
CC       src/od.o
CCLD     src/od.exe
lib/libcoreutils.a(strtold.o):/home/admin/pretest.2019-03-07.10TZXx/coreutils-8.30.87-66e2d.aFLZtq/coreutils-8.30.87-66e2d/lib/strtod.c:305: multiple definition of `minus_zero'
lib/libcoreutils.a(strtod.o):/home/admin/pretest.2019-03-07.10TZXx/coreutils-8.30.87-66e2d.aFLZtq/coreutils-8.30.87-66e2d/lib/strtod.c:305: first defined here
collect2: error: ld returned 1 exit status
make[2]: *** [Makefile:8537: src/od.exe] Error 1
make[2]: Leaving directory '/home/admin/pretest.2019-03-07.10TZXx/coreutils-8.30.87-66e2d.aFLZtq/coreutils-8.30.87-66e2d'
make[1]: *** [Makefile:12165: all-recursive] Error 1
make[1]: Leaving directory '/home/admin/pretest.2019-03-07.10TZXx/coreutils-8.30.87-66e2d.aFLZtq/coreutils-8.30.87-66e2d'
make: *** [Makefile:6351: all] Error 2

Build information

PATH /bin:/cygdrive/c/ProgramData/Oracle/Java/javapath:/cygdrive/c/Program Files (x86)/HP SimplePass 2011/x64:/cygdrive/c/Program Files (x86)/HP SimplePass 2011:/cygdrive/c/WINDOWS/system32:/cygdrive/c/WINDOWS:/cygdrive/c/WINDOWS/System32/Wbem:/cygdrive/c/WINDOWS/System32/WindowsPowerShell/v1.0:/cygdrive/c/Program Files (x86)/QuickTime/QTSystem:/cygdrive/c/Program Files/Git/cmd:/cygdrive/c/Program Files/PuTTY:/cygdrive/c/WINDOWS/System32/OpenSSH:/cygdrive/c/WINDOWS/system32/config/systemprofile/AppData/Local/Microsoft/WindowsApps
SHELL /bin/bash
PWD /home/admin/pretest.2019-03-07.10TZXx/coreutils-8.30.87-66e2d.aFLZtq
hostname Anne-HP
SOURCE http://agnx.s3.amazonaws.com/tmp/coreutils-8.30.87-66e2d.tar.xz
BASENAME coreutils-8.30.87-66e2d
configure_extra_params
make_extra_params
make_check_extra_params
env_extra_params
git_branch

Build host information

autoconf-version autoconf (GNU Autoconf) 2.69
automake-version automake (GNU automake) 1.15.1
autopoint-version missing
autoreconf-version autoreconf (GNU Autoconf) 2.69
make-version GNU Make 4.2.1
makeinfo-version texi2any (GNU texinfo) 6.5
git-version git version 2.17.0
wget-version GNU Wget 1.19.1 built on cygwin.
rsync-version rsync version 3.1.2 protocol version 31
gcc-version gcc (GCC) 7.3.0
cc-version cc (GCC) 7.3.0
uname-s CYGWIN_NT-10.0
uname-r 2.11.1(0.329/5/3)
uname-m x86_64
uname-p unknown
uname-i unknown
uname-o Cygwin
uname-v 2018-09-05 10:24
lsb_release-v
lsb_release-i
lsb_release-d
lsb_release-r
lsb_release-c
etc_release
etc_issue

Download Log Files

logs/config.log 3.4 MB curl -JLO 'http://pretest.housegordon.org/g/6164/logs/config.log'
logs/config.status 104.1 kB curl -JLO 'http://pretest.housegordon.org/g/6164/logs/config.status'
logs/configure.log 46.2 kB curl -JLO 'http://pretest.housegordon.org/g/6164/logs/configure.log'
logs/configure.ok 0 Bytes curl -JLO 'http://pretest.housegordon.org/g/6164/logs/configure.ok'
logs/environment.txt 642 Bytes curl -JLO 'http://pretest.housegordon.org/g/6164/logs/environment.txt'
logs/input.txt 202 Bytes curl -JLO 'http://pretest.housegordon.org/g/6164/logs/input.txt'
logs/make.log 13.1 kB curl -JLO 'http://pretest.housegordon.org/g/6164/logs/make.log'
logs/status 12 Bytes curl -JLO 'http://pretest.housegordon.org/g/6164/logs/status'
logs/tail-error.log 1.8 kB curl -JLO 'http://pretest.housegordon.org/g/6164/logs/tail-error.log'
logs/timestamp.start.txt 76 Bytes curl -JLO 'http://pretest.housegordon.org/g/6164/logs/timestamp.start.txt'
logs/versions.txt 684 Bytes curl -JLO 'http://pretest.housegordon.org/g/6164/logs/versions.txt'