Pretest Build Reports - Build 6153 details

For more information see http://pretest.nongnu.org.

← back to list

Project: coreutils-8.30.79-efa3e
Source: http://agnx.s3.amazonaws.com/tmp/coreutils-8.30.79-efa3e.tar.xz
System: Oracle SunOS 5.11 (i86pc)
Status:
make failed
Download logs (what's inside?) coreutils-8.30.79-efa3e.pretest-build-report.build-6153.tar.bz2
Last lines of tail-error.log:
make failed, tail of make.log:

CCLD     src/cat
CC       src/chcon.o
CCLD     src/chcon
CC       src/chgrp.o
CC       src/chown-core.o
CCLD     src/chgrp
CC       src/chmod.o
CCLD     src/chmod
CC       src/chown.o
CCLD     src/chown
CC       src/cksum.o
CCLD     src/cksum
CC       src/comm.o
CCLD     src/comm
CC       src/cp.o
CC       src/copy.o
CC       src/cp-hash.o
CC       src/extent-scan.o
CC       src/force-link.o
CC       src/selinux.o
CCLD     src/cp
CC       src/csplit.o
CCLD     src/csplit
CC       src/cut.o
CC       src/set-fields.o
CCLD     src/cut
CC       src/date.o
CCLD     src/date
CC       src/dd.o
CCLD     src/dd
CC       src/ls.o
CC       src/ls-dir.o
CCLD     src/dir
CC       src/dircolors.o
CCLD     src/dircolors
CC       src/dirname.o
CCLD     src/dirname
CC       src/du.o
CCLD     src/du
CC       src/echo.o
CCLD     src/echo
CC       src/env.o
src/env.c:62:25: error: variably modified 'signals' at file scope
static enum SIGNAL_MODE signals[SIGNUM_BOUND + 1];
^
make[2]: *** [src/env.o] Error 1
make[2]: Leaving directory `/home/agn/pretest.2019-03-05.pLaGbm/unstable11x/coreutils-8.30.79-efa3e.mMTDY1/coreutils-8.30.79-efa3e'
make[1]: *** [all-recursive] Error 1
make[1]: Leaving directory `/home/agn/pretest.2019-03-05.pLaGbm/unstable11x/coreutils-8.30.79-efa3e.mMTDY1/coreutils-8.30.79-efa3e'
make: *** [all] Error 2

Build information

PATH /usr/gnu/bin:/usr/xpg6/bin:/usr/xpg4/bin/:/opt/csw/bin:usr/sfw/bin:/usr/bin:/bin
SHELL /opt/csw/bin/bash
PWD /home/agn/pretest.2019-03-05.pLaGbm/unstable11x/coreutils-8.30.79-efa3e.mMTDY1
hostname unstable11x
SOURCE http://agnx.s3.amazonaws.com/tmp/coreutils-8.30.79-efa3e.tar.xz
BASENAME coreutils-8.30.79-efa3e
configure_extra_params
make_extra_params
make_check_extra_params SUBDIRS=.
env_extra_params
git_branch

Build host information

autoconf-version autoconf (GNU Autoconf) 2.69
automake-version automake (GNU automake) 1.15.1
autopoint-version /usr/bin/autopoint (GNU gettext-tools) 0.16.1
autoreconf-version autoreconf (GNU Autoconf) 2.69
make-version GNU Make 3.82
makeinfo-version texi2any (GNU texinfo) 6.1
git-version git version 2.4.0
wget-version GNU Wget 1.19.4 built on solaris2.10.
rsync-version rsync version 3.1.2 protocol version 31
gcc-version gcc (GCC) 5.5.0
cc-version missing
uname-s SunOS
uname-r 5.11
uname-m i86pc
uname-p i386
uname-i i86pc
uname-o Solaris
uname-v 11.3
lsb_release-v
lsb_release-i
lsb_release-d
lsb_release-r
lsb_release-c
etc_release Oracle Solaris 11.3 X86
etc_issue

Download Log Files

logs/environment.txt 214 Bytes curl -JLO 'http://pretest.housegordon.org/g/6153/logs/environment.txt'
logs/tail-error.log 1.5 kB curl -JLO 'http://pretest.housegordon.org/g/6153/logs/tail-error.log'
logs/config.log 3.4 MB curl -JLO 'http://pretest.housegordon.org/g/6153/logs/config.log'
logs/versions.txt 702 Bytes curl -JLO 'http://pretest.housegordon.org/g/6153/logs/versions.txt'
logs/status 12 Bytes curl -JLO 'http://pretest.housegordon.org/g/6153/logs/status'
logs/make.log 11.6 kB curl -JLO 'http://pretest.housegordon.org/g/6153/logs/make.log'
logs/timestamp.start.txt 76 Bytes curl -JLO 'http://pretest.housegordon.org/g/6153/logs/timestamp.start.txt'
logs/configure.log 45.5 kB curl -JLO 'http://pretest.housegordon.org/g/6153/logs/configure.log'
logs/config.status 104.3 kB curl -JLO 'http://pretest.housegordon.org/g/6153/logs/config.status'
logs/input.txt 212 Bytes curl -JLO 'http://pretest.housegordon.org/g/6153/logs/input.txt'
logs/configure.ok 0 Bytes curl -JLO 'http://pretest.housegordon.org/g/6153/logs/configure.ok'