Pretest Build Reports - Build 6147 details

For more information see http://pretest.nongnu.org.

← back to list

Project: coreutils-8.30.79-efa3e
Source: http://agnx.s3.amazonaws.com/tmp/coreutils-8.30.79-efa3e.tar.xz
System: Debian 8.11 (i686)
Status:
make-check failed
Download logs (what's inside?) coreutils-8.30.79-efa3e.pretest-build-report.build-6147.tar.bz2
Failed tests from tests-suite-summary.log:
=========================================================
GNU coreutils 8.30.79-efa3e: ./tests/test-suite.log
=========================================================

# TOTAL: 616
# PASS:  490
# SKIP:  125
# XFAIL: 0
# FAIL:  1
# XPASS: 0
# ERROR: 0

FAIL: tests/cp/fiemap-perf
==========================

++ initial_cwd_=/home/agn/tmp/pretest.2019-03-04.BK27Pp/coreutils-8.30.79-efa3e.Bnuup8/coreutils-8.30.79-efa3e
+++ testdir_prefix_
+++ printf gt
++ pfx_=gt
+++ mktempd_ /home/agn/tmp/pretest.2019-03-04.BK27Pp/coreutils-8.30.79-efa3e.Bnuup8/coreutils-8.30.79-efa3e gt-fiemap-perf.sh.XXXX
+++ case $# in
+++ destdir_=/home/agn/tmp/pretest.2019-03-04.BK27Pp/coreutils-8.30.79-efa3e.Bnuup8/coreutils-8.30.79-efa3e
+++ template_=gt-fiemap-perf.sh.XXXX
+++ MAX_TRIES_=4
+++ case $destdir_ in
+++ destdir_slash_=/home/agn/tmp/pretest.2019-03-04.BK27Pp/coreutils-8.30.79-efa3e.Bnuup8/coreutils-8.30.79-efa3e/
+++ case $template_ in
++++ unset TMPDIR
+++ d=/home/agn/tmp/pretest.2019-03-04.BK27Pp/coreutils-8.30.79-efa3e.Bnuup8/coreutils-8.30.79-efa3e/gt-fiemap-perf.sh.zcJx
+++ case $d in
+++ :
+++ test -d /home/agn/tmp/pretest.2019-03-04.BK27Pp/coreutils-8.30.79-efa3e.Bnuup8/coreutils-8.30.79-efa3e/gt-fiemap-perf.sh.zcJx
++++ ls -dgo /home/agn/tmp/pretest.2019-03-04.BK27Pp/coreutils-8.30.79-efa3e.Bnuup8/coreutils-8.30.79-efa3e/gt-fiemap-perf.sh.zcJx
+++ perms='drwx------ 2 4096 Mar  4 23:13 /home/agn/tmp/pretest.2019-03-04.BK27Pp/coreutils-8.30.79-efa3e.Bnuup8/coreutils-8.30.79-efa3e/gt-fiemap-perf.sh.zcJx'
+++ case $perms in
+++ :
+++ echo /home/agn/tmp/pretest.2019-03-04.BK27Pp/coreutils-8.30.79-efa3e.Bnuup8/coreutils-8.30.79-efa3e/gt-fiemap-perf.sh.zcJx
+++ return
++ test_dir_=/home/agn/tmp/pretest.2019-03-04.BK27Pp/coreutils-8.30.79-efa3e.Bnuup8/coreutils-8.30.79-efa3e/gt-fiemap-perf.sh.zcJx
++ cd /home/agn/tmp/pretest.2019-03-04.BK27Pp/coreutils-8.30.79-efa3e.Bnuup8/coreutils-8.30.79-efa3e/gt-fiemap-perf.sh.zcJx
++ gl_init_sh_nl_='
'
++ IFS='
'
++ for sig_ in 1 2 3 13 15
+++ expr 1 + 128
++ eval 'trap '\''Exit 129'\'' 1'
+++ trap 'Exit 129' 1
++ for sig_ in 1 2 3 13 15
+++ expr 2 + 128
++ eval 'trap '\''Exit 130'\'' 2'
+++ trap 'Exit 130' 2
++ for sig_ in 1 2 3 13 15
+++ expr 3 + 128
++ eval 'trap '\''Exit 131'\'' 3'
+++ trap 'Exit 131' 3
++ for sig_ in 1 2 3 13 15
+++ expr 13 + 128
++ eval 'trap '\''Exit 141'\'' 13'
+++ trap 'Exit 141' 13
++ for sig_ in 1 2 3 13 15
+++ expr 15 + 128
++ eval 'trap '\''Exit 143'\'' 15'
+++ trap 'Exit 143' 15
++ trap remove_tmp_ 0
+ path_prepend_ ./src
+ test 1 '!=' 0
+ path_dir_=./src
+ case $path_dir_ in
+ abs_path_dir_=/home/agn/tmp/pretest.2019-03-04.BK27Pp/coreutils-8.30.79-efa3e.Bnuup8/coreutils-8.30.79-efa3e/./src
+ case $abs_path_dir_ in
+ PATH=/home/agn/tmp/pretest.2019-03-04.BK27Pp/coreutils-8.30.79-efa3e.Bnuup8/coreutils-8.30.79-efa3e/./src:/home/agn/tmp/pretest.2019-03-04.BK27Pp/coreutils-8.30.79-efa3e.Bnuup8/coreutils-8.30.79-efa3e/src:/usr/local/bin:/usr/bin:/bin:/usr/games:/sbin:/usr/sbin
+ create_exe_shims_ /home/agn/tmp/pretest.2019-03-04.BK27Pp/coreutils-8.30.79-efa3e.Bnuup8/coreutils-8.30.79-efa3e/./src
+ case $EXEEXT in
+ return 0
+ shift
+ test 0 '!=' 0
+ export PATH
+ print_ver_ cp
+ require_built_ cp
+ skip_=no
+ for i in '"$@"'
+ case " $built_programs " in
+ test no = yes
+ test yes = yes
+ local i
+ for i in '$*'
+ env cp --version
cp (GNU coreutils) 8.30.79-efa3e
Copyright (C) 2019 Free Software Foundation, Inc.
License GPLv3+: GNU GPL version 3 or later <https://gnu.org/licenses/gpl.html>.
This is free software: you are free to change and redistribute it.
There is NO WARRANTY, to the extent permitted by law.

Written by Torbjorn Granlund, David MacKenzie, and Jim Meyering.
+ touch fiemap_chk
+ fiemap_capable_ fiemap_chk
+ python
+ python /home/agn/tmp/pretest.2019-03-04.BK27Pp/coreutils-8.30.79-efa3e.Bnuup8/coreutils-8.30.79-efa3e/tests/fiemap-capable fiemap_chk
+ df -t ext2 -t ext3 .
df: no file systems processed
+ timeout 10 truncate -s1T f
+ filefrag f
f: 0 extents found
+ filefrag f
+ grep -F ': 0 extents found'
+ timeout 10 cp f f2
+ fail=1
++ stat --printf %s f
++ stat --printf %s f2
+ test 1099511627776 = 0
+ fail=1
+ Exit 1
+ set +e
+ exit 1
+ exit 1
+ remove_tmp_
+ __st=1
+ cleanup_
+ :
+ test '' = yes
+ cd /home/agn/tmp/pretest.2019-03-04.BK27Pp/coreutils-8.30.79-efa3e.Bnuup8/coreutils-8.30.79-efa3e
+ chmod -R u+rwx /home/agn/tmp/pretest.2019-03-04.BK27Pp/coreutils-8.30.79-efa3e.Bnuup8/coreutils-8.30.79-efa3e/gt-fiemap-perf.sh.zcJx
+ rm -rf /home/agn/tmp/pretest.2019-03-04.BK27Pp/coreutils-8.30.79-efa3e.Bnuup8/coreutils-8.30.79-efa3e/gt-fiemap-perf.sh.zcJx
+ exit 1
FAIL tests/cp/fiemap-perf.sh (exit status: 1)
Last lines of tail-error.log:
make-check failed, tail of make-check.log:


env RUN_VERY_EXPENSIVE_TESTS=yes make check

or use the shortcut target of the toplevel Makefile,

make check-very-expensive
'
+ Exit 77
+ set +e
+ exit 77
+ exit 77
+ remove_tmp_
+ __st=77
+ cleanup_
+ :
+ test '' = yes
+ cd /home/agn/tmp/pretest.2019-03-04.BK27Pp/coreutils-8.30.79-efa3e.Bnuup8/coreutils-8.30.79-efa3e
+ chmod -R u+rwx /home/agn/tmp/pretest.2019-03-04.BK27Pp/coreutils-8.30.79-efa3e.Bnuup8/coreutils-8.30.79-efa3e/gt-t36.sh.aPnT
+ rm -rf /home/agn/tmp/pretest.2019-03-04.BK27Pp/coreutils-8.30.79-efa3e.Bnuup8/coreutils-8.30.79-efa3e/gt-t36.sh.aPnT
+ exit 77
SKIP tests/factor/t36.sh (exit status: 77)

============================================================================
Testsuite summary for GNU coreutils 8.30.79-efa3e
============================================================================
# TOTAL: 616
# PASS:  490
# SKIP:  125
# XFAIL: 0
# FAIL:  1
# XPASS: 0
# ERROR: 0
============================================================================
See ./tests/test-suite.log
Please report to bug-coreutils@gnu.org
============================================================================
Makefile:12279: recipe for target 'tests/test-suite.log' failed
make[4]: *** [tests/test-suite.log] Error 1
make[4]: Leaving directory '/home/agn/tmp/pretest.2019-03-04.BK27Pp/coreutils-8.30.79-efa3e.Bnuup8/coreutils-8.30.79-efa3e'
Makefile:12385: recipe for target 'check-TESTS' failed
make[3]: *** [check-TESTS] Error 2
make[3]: Leaving directory '/home/agn/tmp/pretest.2019-03-04.BK27Pp/coreutils-8.30.79-efa3e.Bnuup8/coreutils-8.30.79-efa3e'
Makefile:12640: recipe for target 'check-am' failed
make[2]: *** [check-am] Error 2
make[2]: Leaving directory '/home/agn/tmp/pretest.2019-03-04.BK27Pp/coreutils-8.30.79-efa3e.Bnuup8/coreutils-8.30.79-efa3e'
Makefile:12165: recipe for target 'check-recursive' failed
make[1]: *** [check-recursive] Error 1
make[1]: Leaving directory '/home/agn/tmp/pretest.2019-03-04.BK27Pp/coreutils-8.30.79-efa3e.Bnuup8/coreutils-8.30.79-efa3e'
Makefile:12642: recipe for target 'check' failed
make: *** [check] Error 2

Build information

PATH /usr/local/bin:/usr/bin:/bin:/usr/games
SHELL /bin/bash
PWD /home/agn/tmp/pretest.2019-03-04.BK27Pp/coreutils-8.30.79-efa3e.Bnuup8
hostname gcc45
SOURCE http://agnx.s3.amazonaws.com/tmp/coreutils-8.30.79-efa3e.tar.xz
BASENAME coreutils-8.30.79-efa3e
configure_extra_params
make_extra_params
make_check_extra_params SUBDIRS=.
env_extra_params
git_branch

Build host information

autoconf-version autoconf (GNU Autoconf) 2.69
automake-version automake (GNU automake) 1.14.1
autopoint-version /usr/bin/autopoint (GNU gettext-tools) 0.19.3
autoreconf-version autoreconf (GNU Autoconf) 2.69
make-version GNU Make 4.0
makeinfo-version makeinfo (GNU texinfo) 5.2
git-version git version 2.1.4
wget-version GNU Wget 1.16 built on linux-gnu.
rsync-version rsync version 3.1.1 protocol version 31
gcc-version gcc (Debian 4.9.2-10+deb8u2) 4.9.2
cc-version cc (Debian 4.9.2-10+deb8u2) 4.9.2
uname-s Linux
uname-r 3.16.0-6-686-pae
uname-m i686
uname-p unknown
uname-i unknown
uname-o GNU/Linux
uname-v #1 SMP Debian 3.16.56-1+deb8u1 (2018-05-08)
lsb_release-v
lsb_release-i Debian
lsb_release-d Debian GNU/Linux 8.11 (jessie)
lsb_release-r 8.11
lsb_release-c jessie
etc_release
etc_issue Debian GNU/Linux 8 \n \l
etc_os_release_PRETTY_NAME Debian GNU/Linux 8 (jessie)
etc_os_release_NAME Debian GNU/Linux
etc_os_release_VERSION_ID 8
etc_os_release_VERSION 8 (jessie)
etc_os_release_ID debian
etc_os_release_HOME_URL http://www.debian.org/
etc_os_release_SUPPORT_URL http://www.debian.org/support
etc_os_release_BUG_REPORT_URL https://bugs.debian.org/

Download Log Files

logs/config.status 104.1 kB curl -JLO 'http://pretest.housegordon.org/g/6147/logs/config.status'
logs/timestamp.start.txt 76 Bytes curl -JLO 'http://pretest.housegordon.org/g/6147/logs/timestamp.start.txt'
logs/versions.txt 1.2 kB curl -JLO 'http://pretest.housegordon.org/g/6147/logs/versions.txt'
logs/input.txt 212 Bytes curl -JLO 'http://pretest.housegordon.org/g/6147/logs/input.txt'
logs/status 18 Bytes curl -JLO 'http://pretest.housegordon.org/g/6147/logs/status'
logs/make.log 18.3 kB curl -JLO 'http://pretest.housegordon.org/g/6147/logs/make.log'
logs/config.log 3.0 MB curl -JLO 'http://pretest.housegordon.org/g/6147/logs/config.log'
logs/configure.ok 0 Bytes curl -JLO 'http://pretest.housegordon.org/g/6147/logs/configure.ok'
logs/environment.txt 151 Bytes curl -JLO 'http://pretest.housegordon.org/g/6147/logs/environment.txt'
logs/tail-error.log 2.1 kB curl -JLO 'http://pretest.housegordon.org/g/6147/logs/tail-error.log'
logs/tests-suite-summary.log 4.7 kB curl -JLO 'http://pretest.housegordon.org/g/6147/logs/tests-suite-summary.log'
logs/make-check.log 661.0 kB curl -JLO 'http://pretest.housegordon.org/g/6147/logs/make-check.log'
logs/configure.log 45.6 kB curl -JLO 'http://pretest.housegordon.org/g/6147/logs/configure.log'
logs/test-suite.0.log 631.9 kB curl -JLO 'http://pretest.housegordon.org/g/6147/logs/test-suite.0.log'
logs/make.ok 0 Bytes curl -JLO 'http://pretest.housegordon.org/g/6147/logs/make.ok'