Pretest Build Reports - Build 6133 details

For more information see http://pretest.nongnu.org.

← back to list

Project: diffutils-3.6.17-d5ba
Source: https://meyering.net/diff/diffutils-3.6.17-d5ba.tar.xz
System: CYGWIN_NT-10.0 2.11.1(0.329/5/3) (x86_64, host=x86_64-w64-mingw32)
Status:
make failed
Download logs (what's inside?) diffutils-3.6.17-d5ba.pretest-build-report.build-6133.tar.bz2
Last lines of tail-error.log:
make failed, tail of make.log:

AR       libver.a
CCLD     cmp.exe
CC       analyze.o
CC       context.o
CC       diff.o
CC       dir.o
In file included from diff.h:21:0,
from dir.c:21:
dir.c: In function 'compare_collated':
system.h:74:29: warning: implicit declaration of function 'stricoll' [-Wimplicit-function-declaration]
#  define strcasecoll(a, b) stricoll (a, b)
^
dir.c:151:9: note: in expansion of macro 'strcasecoll'
r = strcasecoll (name1, name2);
^~~~~~~~~~~
CC       ed.o
CC       ifdef.o
CC       io.o
CC       normal.o
CC       side.o
CC       util.o
util.c: In function 'process_signals':
util.c:226:17: error: 'SIGSTOP' undeclared (first use in this function)
sig = SIGSTOP;
^~~~~~~
util.c:226:17: note: each undeclared identifier is reported only once for each function it appears in
util.c: In function 'install_signal_handlers':
util.c:247:7: error: 'SIGTSTP' undeclared (first use in this function)
SIGTSTP,
^~~~~~~
util.c:250:7: error: 'SIGALRM' undeclared (first use in this function)
SIGALRM, SIGHUP, SIGINT, SIGPIPE, SIGQUIT, SIGTERM,
^~~~~~~
util.c:250:16: error: 'SIGHUP' undeclared (first use in this function)
SIGALRM, SIGHUP, SIGINT, SIGPIPE, SIGQUIT, SIGTERM,
^~~~~~
util.c:250:32: error: 'SIGPIPE' undeclared (first use in this function)
SIGALRM, SIGHUP, SIGINT, SIGPIPE, SIGQUIT, SIGTERM,
^~~~~~~
util.c:250:41: error: 'SIGQUIT' undeclared (first use in this function)
SIGALRM, SIGHUP, SIGINT, SIGPIPE, SIGQUIT, SIGTERM,
^~~~~~~
util.c:300:36: warning: comparison between pointer and integer
signal (sig[j], sig[j] == SIGTSTP ? stophandler : sighandler);
^~
make[2]: *** [Makefile:1463: util.o] Error 1
make[2]: Leaving directory '/home/admin/pretest.2018-12-26.oEzNlD/diffutils-3.6.17-d5ba.PbjDJd/diffutils-3.6.17-d5ba/src'
make[1]: *** [Makefile:1335: all] Error 2
make[1]: Leaving directory '/home/admin/pretest.2018-12-26.oEzNlD/diffutils-3.6.17-d5ba.PbjDJd/diffutils-3.6.17-d5ba/src'
make: *** [Makefile:1361: all-recursive] Error 1

Build information

PATH /bin:/cygdrive/c/ProgramData/Oracle/Java/javapath:/cygdrive/c/Program Files (x86)/HP SimplePass 2011/x64:/cygdrive/c/Program Files (x86)/HP SimplePass 2011:/cygdrive/c/WINDOWS/system32:/cygdrive/c/WINDOWS:/cygdrive/c/WINDOWS/System32/Wbem:/cygdrive/c/WINDOWS/System32/WindowsPowerShell/v1.0:/cygdrive/c/Program Files (x86)/QuickTime/QTSystem:/cygdrive/c/Program Files/Git/cmd:/cygdrive/c/Program Files/PuTTY:/cygdrive/c/WINDOWS/System32/OpenSSH:/cygdrive/c/WINDOWS/system32/config/systemprofile/AppData/Local/Microsoft/WindowsApps
SHELL /bin/bash
PWD /home/admin/pretest.2018-12-26.oEzNlD/diffutils-3.6.17-d5ba.PbjDJd
hostname Anne-HP
SOURCE https://meyering.net/diff/diffutils-3.6.17-d5ba.tar.xz
BASENAME diffutils-3.6.17-d5ba
configure_extra_params --host=x86_64-w64-mingw32 --disable-nls
make_extra_params
make_check_extra_params
env_extra_params
git_branch

Build host information

autoconf-version autoconf (GNU Autoconf) 2.69
automake-version automake (GNU automake) 1.15.1
autopoint-version missing
autoreconf-version autoreconf (GNU Autoconf) 2.69
make-version GNU Make 4.2.1
makeinfo-version texi2any (GNU texinfo) 6.5
git-version git version 2.17.0
wget-version GNU Wget 1.19.1 built on cygwin.
rsync-version rsync version 3.1.2 protocol version 31
gcc-version gcc (GCC) 7.3.0
cc-version cc (GCC) 7.3.0
uname-s CYGWIN_NT-10.0
uname-r 2.11.1(0.329/5/3)
uname-m x86_64
uname-p unknown
uname-i unknown
uname-o Cygwin
uname-v 2018-09-05 10:24
lsb_release-v
lsb_release-i
lsb_release-d
lsb_release-r
lsb_release-c
etc_release
etc_issue

Download Log Files

logs/config.log 802.1 kB curl -JLO 'http://pretest.housegordon.org/g/6133/logs/config.log'
logs/config.status 76.5 kB curl -JLO 'http://pretest.housegordon.org/g/6133/logs/config.status'
logs/configure.log 19.5 kB curl -JLO 'http://pretest.housegordon.org/g/6133/logs/configure.log'
logs/configure.ok 0 Bytes curl -JLO 'http://pretest.housegordon.org/g/6133/logs/configure.ok'
logs/environment.txt 640 Bytes curl -JLO 'http://pretest.housegordon.org/g/6133/logs/environment.txt'
logs/input.txt 231 Bytes curl -JLO 'http://pretest.housegordon.org/g/6133/logs/input.txt'
logs/make.log 7.3 kB curl -JLO 'http://pretest.housegordon.org/g/6133/logs/make.log'
logs/status 12 Bytes curl -JLO 'http://pretest.housegordon.org/g/6133/logs/status'
logs/tail-error.log 2.3 kB curl -JLO 'http://pretest.housegordon.org/g/6133/logs/tail-error.log'
logs/timestamp.start.txt 76 Bytes curl -JLO 'http://pretest.housegordon.org/g/6133/logs/timestamp.start.txt'
logs/versions.txt 684 Bytes curl -JLO 'http://pretest.housegordon.org/g/6133/logs/versions.txt'