Pretest Build Reports - Build 6132 details

For more information see http://pretest.nongnu.org.

← back to list

Project: diffutils-3.6.17-d5ba
Source: https://meyering.net/diff/diffutils-3.6.17-d5ba.tar.xz
System: CYGWIN_NT-10.0 2.11.1(0.329/5/3) (x86_64)
Status:
make-check failed
Download logs (what's inside?) diffutils-3.6.17-d5ba.pretest-build-report.build-6132.tar.bz2
Failed tests from tests-suite-summary.log:
============================================================
GNU diffutils 3.6.17-d5ba: gnulib-tests/test-suite.log
============================================================

# TOTAL: 173
# PASS:  156
# SKIP:  16
# XFAIL: 0
# FAIL:  1
# XPASS: 0
# ERROR: 0

FAIL: test-wctype-h
===================

test-wctype-h.c:55: assertion '!iswcntrl (e)' failed
FAIL test-wctype-h.exe (exit status: 134)

=====================================================
GNU diffutils 3.6.17-d5ba: tests/test-suite.log
=====================================================

# TOTAL: 21
# PASS:  19
# SKIP:  1
# XFAIL: 1
# FAIL:  0
# XPASS: 0
# ERROR: 0
Last lines of tail-error.log:
make-check failed, tail of make-check.log:


SKIP: test-wcrtomb-w32-3.sh
===========================

Skipping test: not a native Windows system
SKIP test-wcrtomb-w32-3.sh (exit status: 77)

SKIP: test-wcrtomb-w32-4.sh
===========================

Skipping test: not a native Windows system
SKIP test-wcrtomb-w32-4.sh (exit status: 77)

SKIP: test-wcrtomb-w32-5.sh
===========================

Skipping test: not a native Windows system
SKIP test-wcrtomb-w32-5.sh (exit status: 77)

FAIL: test-wctype-h
===================

test-wctype-h.c:55: assertion '!iswcntrl (e)' failed
FAIL test-wctype-h.exe (exit status: 134)

============================================================================
Testsuite summary for GNU diffutils 3.6.17-d5ba
============================================================================
# TOTAL: 173
# PASS:  156
# SKIP:  16
# XFAIL: 0
# FAIL:  1
# XPASS: 0
# ERROR: 0
============================================================================
See gnulib-tests/test-suite.log
Please report to bug-diffutils@gnu.org
============================================================================
make[5]: *** [Makefile:3740: test-suite.log] Error 1
make[5]: Leaving directory '/home/admin/pretest.2018-12-26.oEzNlD/diffutils-3.6.17-d5ba.TnbxNh/diffutils-3.6.17-d5ba/gnulib-tests'
make[4]: *** [Makefile:3848: check-TESTS] Error 2
make[4]: Leaving directory '/home/admin/pretest.2018-12-26.oEzNlD/diffutils-3.6.17-d5ba.TnbxNh/diffutils-3.6.17-d5ba/gnulib-tests'
make[3]: *** [Makefile:5151: check-am] Error 2
make[3]: Leaving directory '/home/admin/pretest.2018-12-26.oEzNlD/diffutils-3.6.17-d5ba.TnbxNh/diffutils-3.6.17-d5ba/gnulib-tests'
make[2]: *** [Makefile:3632: check-recursive] Error 1
make[2]: Leaving directory '/home/admin/pretest.2018-12-26.oEzNlD/diffutils-3.6.17-d5ba.TnbxNh/diffutils-3.6.17-d5ba/gnulib-tests'
make[1]: *** [Makefile:5153: check] Error 2
make[1]: Leaving directory '/home/admin/pretest.2018-12-26.oEzNlD/diffutils-3.6.17-d5ba.TnbxNh/diffutils-3.6.17-d5ba/gnulib-tests'
make: *** [Makefile:1361: check-recursive] Error 1

Build information

PATH /bin:/cygdrive/c/ProgramData/Oracle/Java/javapath:/cygdrive/c/Program Files (x86)/HP SimplePass 2011/x64:/cygdrive/c/Program Files (x86)/HP SimplePass 2011:/cygdrive/c/WINDOWS/system32:/cygdrive/c/WINDOWS:/cygdrive/c/WINDOWS/System32/Wbem:/cygdrive/c/WINDOWS/System32/WindowsPowerShell/v1.0:/cygdrive/c/Program Files (x86)/QuickTime/QTSystem:/cygdrive/c/Program Files/Git/cmd:/cygdrive/c/Program Files/PuTTY:/cygdrive/c/WINDOWS/System32/OpenSSH:/cygdrive/c/WINDOWS/system32/config/systemprofile/AppData/Local/Microsoft/WindowsApps
SHELL /bin/bash
PWD /home/admin/pretest.2018-12-26.oEzNlD/diffutils-3.6.17-d5ba.TnbxNh
hostname Anne-HP
SOURCE https://meyering.net/diff/diffutils-3.6.17-d5ba.tar.xz
BASENAME diffutils-3.6.17-d5ba
configure_extra_params
make_extra_params
make_check_extra_params
env_extra_params
git_branch

Build host information

autoconf-version autoconf (GNU Autoconf) 2.69
automake-version automake (GNU automake) 1.15.1
autopoint-version missing
autoreconf-version autoreconf (GNU Autoconf) 2.69
make-version GNU Make 4.2.1
makeinfo-version texi2any (GNU texinfo) 6.5
git-version git version 2.17.0
wget-version GNU Wget 1.19.1 built on cygwin.
rsync-version rsync version 3.1.2 protocol version 31
gcc-version gcc (GCC) 7.3.0
cc-version cc (GCC) 7.3.0
uname-s CYGWIN_NT-10.0
uname-r 2.11.1(0.329/5/3)
uname-m x86_64
uname-p unknown
uname-i unknown
uname-o Cygwin
uname-v 2018-09-05 10:24
lsb_release-v
lsb_release-i
lsb_release-d
lsb_release-r
lsb_release-c
etc_release
etc_issue

Download Log Files

logs/config.log 501.9 kB curl -JLO 'http://pretest.housegordon.org/g/6132/logs/config.log'
logs/config.status 76.2 kB curl -JLO 'http://pretest.housegordon.org/g/6132/logs/config.status'
logs/configure.log 20.9 kB curl -JLO 'http://pretest.housegordon.org/g/6132/logs/configure.log'
logs/configure.ok 0 Bytes curl -JLO 'http://pretest.housegordon.org/g/6132/logs/configure.ok'
logs/environment.txt 640 Bytes curl -JLO 'http://pretest.housegordon.org/g/6132/logs/environment.txt'
logs/input.txt 191 Bytes curl -JLO 'http://pretest.housegordon.org/g/6132/logs/input.txt'
logs/make-check.log 290.4 kB curl -JLO 'http://pretest.housegordon.org/g/6132/logs/make-check.log'
logs/make.log 6.7 kB curl -JLO 'http://pretest.housegordon.org/g/6132/logs/make.log'
logs/make.ok 0 Bytes curl -JLO 'http://pretest.housegordon.org/g/6132/logs/make.ok'
logs/status 18 Bytes curl -JLO 'http://pretest.housegordon.org/g/6132/logs/status'
logs/tail-error.log 2.1 kB curl -JLO 'http://pretest.housegordon.org/g/6132/logs/tail-error.log'
logs/test-suite.0.log 269.2 kB curl -JLO 'http://pretest.housegordon.org/g/6132/logs/test-suite.0.log'
logs/test-suite.1.log 9.0 kB curl -JLO 'http://pretest.housegordon.org/g/6132/logs/test-suite.1.log'
logs/tests-suite-summary.log 641 Bytes curl -JLO 'http://pretest.housegordon.org/g/6132/logs/tests-suite-summary.log'
logs/timestamp.start.txt 76 Bytes curl -JLO 'http://pretest.housegordon.org/g/6132/logs/timestamp.start.txt'
logs/versions.txt 684 Bytes curl -JLO 'http://pretest.housegordon.org/g/6132/logs/versions.txt'