Pretest Build Reports - Build 6116 details

For more information see http://pretest.nongnu.org.

← back to list

Project: gzip-1.9.15-17f5c
Source: https://meyering.net/gzip/gzip-1.9.15-17f5c.tar.xz
System: CYGWIN_NT-10.0 2.11.1(0.329/5/3) (x86_64, host=x86_64-w64-mingw32)
Status:
make-check failed
Download logs (what's inside?) gzip-1.9.15-17f5c.pretest-build-report.build-6116.tar.bz2
Last lines of tail-error.log:
make-check failed, tail of make-check.log:

GEN      public-submodule-commit
make  check-recursive
make[1]: Entering directory '/home/admin/pretest.2018-12-23.hvoh4Y/gzip-1.9.15-17f5c.GR0tzE/gzip-1.9.15-17f5c'
Making check in lib
make[2]: Entering directory '/home/admin/pretest.2018-12-23.hvoh4Y/gzip-1.9.15-17f5c.GR0tzE/gzip-1.9.15-17f5c/lib'
make  check-am
make[3]: Entering directory '/home/admin/pretest.2018-12-23.hvoh4Y/gzip-1.9.15-17f5c.GR0tzE/gzip-1.9.15-17f5c/lib'
make[3]: Leaving directory '/home/admin/pretest.2018-12-23.hvoh4Y/gzip-1.9.15-17f5c.GR0tzE/gzip-1.9.15-17f5c/lib'
make[2]: Leaving directory '/home/admin/pretest.2018-12-23.hvoh4Y/gzip-1.9.15-17f5c.GR0tzE/gzip-1.9.15-17f5c/lib'
Making check in doc
make[2]: Entering directory '/home/admin/pretest.2018-12-23.hvoh4Y/gzip-1.9.15-17f5c.GR0tzE/gzip-1.9.15-17f5c/doc'
make[2]: Nothing to be done for 'check'.
make[2]: Leaving directory '/home/admin/pretest.2018-12-23.hvoh4Y/gzip-1.9.15-17f5c.GR0tzE/gzip-1.9.15-17f5c/doc'
Making check in .
make[2]: Entering directory '/home/admin/pretest.2018-12-23.hvoh4Y/gzip-1.9.15-17f5c.GR0tzE/gzip-1.9.15-17f5c'
make  check-local
make[3]: Entering directory '/home/admin/pretest.2018-12-23.hvoh4Y/gzip-1.9.15-17f5c.GR0tzE/gzip-1.9.15-17f5c'
GEN      gzip.doc.gz
C:/cygwin64/home/admin/pretest.2018-12-23.hvoh4Y/gzip-1.9.15-17f5c.GR0tzE/gzip-1.9.15-17f5c/gzip.exe: error while loading shared libraries: libwinpthread-1.dll: cannot open shared object file: No such file or directory
make[3]: *** [Makefile:2249: gzip.doc.gz] Error 127
make[3]: Leaving directory '/home/admin/pretest.2018-12-23.hvoh4Y/gzip-1.9.15-17f5c.GR0tzE/gzip-1.9.15-17f5c'
make[2]: *** [Makefile:2061: check-am] Error 2
make[2]: Leaving directory '/home/admin/pretest.2018-12-23.hvoh4Y/gzip-1.9.15-17f5c.GR0tzE/gzip-1.9.15-17f5c'
make[1]: *** [Makefile:1768: check-recursive] Error 1
make[1]: Leaving directory '/home/admin/pretest.2018-12-23.hvoh4Y/gzip-1.9.15-17f5c.GR0tzE/gzip-1.9.15-17f5c'
make: *** [Makefile:2063: check] Error 2

Build information

PATH /usr/local/bin:/usr/bin:/bin:/cygdrive/c/ProgramData/Oracle/Java/javapath:/cygdrive/c/Program Files (x86)/HP SimplePass 2011/x64:/cygdrive/c/Program Files (x86)/HP SimplePass 2011:/cygdrive/c/WINDOWS/system32:/cygdrive/c/WINDOWS:/cygdrive/c/WINDOWS/System32/Wbem:/cygdrive/c/WINDOWS/System32/WindowsPowerShell/v1.0:/cygdrive/c/Program Files (x86)/QuickTime/QTSystem:/cygdrive/c/Program Files/Git/cmd:/cygdrive/c/Program Files/PuTTY:/cygdrive/c/WINDOWS/System32/OpenSSH:/cygdrive/c/WINDOWS/system32/config/systemprofile/AppData/Local/Microsoft/WindowsApps
SHELL /bin/bash
PWD /home/admin/pretest.2018-12-23.hvoh4Y/gzip-1.9.15-17f5c.GR0tzE
hostname Anne-HP
SOURCE https://meyering.net/gzip/gzip-1.9.15-17f5c.tar.xz
BASENAME gzip-1.9.15-17f5c
configure_extra_params --host=x86_64-w64-mingw32 --disable-nls
make_extra_params
make_check_extra_params
env_extra_params
git_branch

Build host information

autoconf-version autoconf (GNU Autoconf) 2.69
automake-version automake (GNU automake) 1.15.1
autopoint-version missing
autoreconf-version autoreconf (GNU Autoconf) 2.69
make-version GNU Make 4.2.1
makeinfo-version texi2any (GNU texinfo) 6.5
git-version git version 2.17.0
wget-version GNU Wget 1.19.1 built on cygwin.
rsync-version rsync version 3.1.2 protocol version 31
gcc-version gcc (GCC) 7.3.0
cc-version cc (GCC) 7.3.0
uname-s CYGWIN_NT-10.0
uname-r 2.11.1(0.329/5/3)
uname-m x86_64
uname-p unknown
uname-i unknown
uname-o Cygwin
uname-v 2018-09-05 10:24
lsb_release-v
lsb_release-i
lsb_release-d
lsb_release-r
lsb_release-c
etc_release
etc_issue

Download Log Files

logs/config.log 530.2 kB curl -JLO 'http://pretest.housegordon.org/g/6116/logs/config.log'
logs/config.status 68.8 kB curl -JLO 'http://pretest.housegordon.org/g/6116/logs/config.status'
logs/configure.log 14.9 kB curl -JLO 'http://pretest.housegordon.org/g/6116/logs/configure.log'
logs/configure.ok 0 Bytes curl -JLO 'http://pretest.housegordon.org/g/6116/logs/configure.ok'
logs/environment.txt 660 Bytes curl -JLO 'http://pretest.housegordon.org/g/6116/logs/environment.txt'
logs/input.txt 223 Bytes curl -JLO 'http://pretest.housegordon.org/g/6116/logs/input.txt'
logs/make-check.log 2.0 kB curl -JLO 'http://pretest.housegordon.org/g/6116/logs/make-check.log'
logs/make.log 4.7 kB curl -JLO 'http://pretest.housegordon.org/g/6116/logs/make.log'
logs/make.ok 0 Bytes curl -JLO 'http://pretest.housegordon.org/g/6116/logs/make.ok'
logs/status 18 Bytes curl -JLO 'http://pretest.housegordon.org/g/6116/logs/status'
logs/tail-error.log 2.0 kB curl -JLO 'http://pretest.housegordon.org/g/6116/logs/tail-error.log'
logs/timestamp.start.txt 76 Bytes curl -JLO 'http://pretest.housegordon.org/g/6116/logs/timestamp.start.txt'
logs/versions.txt 684 Bytes curl -JLO 'http://pretest.housegordon.org/g/6116/logs/versions.txt'