Pretest Build Reports - Build 6081 details

For more information see http://pretest.nongnu.org.

← back to list

Project: datamash-1.4
Source: https://agnx.s3.amazonaws.com/tmp/datamash-1.4.tar.gz
System: Oracle SunOS 5.11 (sun4u)
Status:
make-check failed
Download logs (what's inside?) datamash-1.4.pretest-build-report.build-6081.tar.bz2
Failed tests from tests-suite-summary.log:
========================================
GNU datamash 1.4: ./test-suite.log
========================================

# TOTAL: 20
# PASS:  17
# SKIP:  2
# XFAIL: 0
# FAIL:  1
# XPASS: 0
# ERROR: 0

FAIL: tests/datamash-output-format
==================================

datamash (GNU datamash) 1.4
Copyright (C) 2018 Assaf Gordon
License GPLv3+: GNU GPL version 3 or later <https://gnu.org/licenses/gpl.html>.
This is free software: you are free to change and redistribute it.
There is NO WARRANTY, to the extent permitted by law.

Written by Assaf Gordon.
r1...
r2...
r3...
r4...
r5...
r6...
r7...
r8...
r9...
f1...
f2...
f3...
f4...
f5...
f6...
f7...
g1...
g2...
g3...
g4...
g5...
g6...
g7...
e1...
e2...
m1...
m2...
datamash-output-format.pl: test m2: stdout mismatch, comparing m2.2 (expected) and m2.O (actual)
*** m2.2	Sun Dec 23 04:11:03 2018
--- m2.O	Sun Dec 23 04:11:03 2018
***************
*** 1 ****
! 1.00000X
--- 1 ----
! 1.0000090000000000000000000000000000036854595415794145284079193909305169167545113140249668504111468791961669921875000000000000000000000000000000000000000000000000000000000000000000000000000000000000000000000000000000000000000000000000000000000000000000000000000000000000000000000000000000000000000000000000000000000000000000000000000000000000000000000000000000000000000000000000000000000000000000000000000000000000000000000000000000000000000000000000000000000000000000000000000000000000000000000000000000000000000000000000000000000000000000000000000000000000000000000000000000000000000000000000000000000000000000000000000000000000000000000000000000000000000000000000000000000000000000000000000000000000000000000000000000000000000000000000000000000000000000000000000000000000000000000000000000000000000000000000000000000000000000000000000000000000000000000000000000000000000000000000000000000000000000000000000000000000000000000000000000000000000000000000000000000000000000000000000000000000000000000000000000000000000000000000000000000000000000000000000000000000000000000000000000000000000000000000000000000000000000000000000000000000000000000000000000000000000000000000000000000000000000000000000000000000000000000000000000000000000000000000000000000000000000000000000000000000000000000000000000000000000000000000000000000000000000000000000000000000000000000000000000000000000000000000000000000000000000000000000000000000000000000000000000000000000000000000000000000000000000000000000000000000000000000000000000000000000000000000000000000000000000000000000000000000000000000000000000000000000000000000000000000000000000000000000000000000000000000000000000000000000000000000000000000000000000000000000000000000000000000000000000000000000000000000000000000000000000000000000000000000000000000000000000000000000000000000000000000000000000000000000000000000000000000000000000000000000000000000000000000000000000000000000000000000000000000000000000000000000000000000000000000000000000000000000000000000000000000000000000000000000000000000000000000000000000000000000000000000000000000000000000000000000000000000000000000000000000000000000000000000000000000000000000000000000000000000000000000000000000000000000000000000000000000000000000000000000000000000000000000000000000000000000000000000000000000000000000000000000000000000000000000000000000000000000000000000000000000000000000000000000000000000000000000000000000000000000000000000000000000000000000000000000000000000000000000000000000000000000000000000000000000000000000000000000000000000000000000000000000000000000000000000000000000000000000000000000000000000000000000000000000000000000000000000000000000000000000000000000000000000000000000000000000000000000000000000000000000000000000000000000000000000000000000000000000000000000000000000000000000000000000000000000000000000000000000000000000000000000000000000000000000000000000000000000000000000000000000000000000000000000000000000000000000000000000000000000000000000000000000000000000000000000000000000000000000000000000000000000000000000000000000000000000000000000000000000000000000000000000000000000000000000000000000000000000000000000000000000000000000000000000000000000000000000000000000000000000000000000000000000000000000000000000000000000000000000000000000000000000000000000000000000000000000000000000000000000000000000000000000000000000000000000000000000000000000000000000000000000000000000000000000000000000000000000000000000000000000000000000000000000000000000000000000000000000000000000000000000000000000000000000000000000000000000000000000000000000000000000000000000000000000000000000000000000000000000000000000000000000000000000000000000000000000000000000000000000000000000000000000000000000000000000000000000000000000000000000000000000000000000000000000000000000000000000000000000000000000000000000000000000000000000000000000000000000000000000000000000000000000000000000000000000000000000000000000000000000000000000000000000000000000000000000000000000000000000000000000000000000000000e+00
FAIL tests/datamash-output-format.pl (exit status: 1)
Last lines of tail-error.log:
make-check failed, tail of make-check.log:

+ test 9 = 2
+ printf '%s\n' 'datamash-valgrind.sh: skipped test: expensive: disabled by default
This test is relatively expensive, so it is disabled by default.
To run it anyway, rerun make check with the RUN_EXPENSIVE_TESTS
environment variable set to yes.  E.g.,

env RUN_EXPENSIVE_TESTS=yes make check

or use the shortcut target of the toplevel Makefile,

make check-expensive
'
+ sed 1q
+ Exit 77
+ set +e
+ exit 77
+ exit 77
+ remove_tmp_
+ __st=77
+ cleanup_
+ :
+ cd /home/agn/pretest.2018-12-23.l.aaKn/datamash-1.4.Zop8GI/datamash-1.4
+ chmod -R u+rwx /home/agn/pretest.2018-12-23.l.aaKn/datamash-1.4.Zop8GI/datamash-1.4/gt-datamash-valgrind.sh.cvfB
+ rm -rf /home/agn/pretest.2018-12-23.l.aaKn/datamash-1.4.Zop8GI/datamash-1.4/gt-datamash-valgrind.sh.cvfB
+ exit 77
SKIP tests/datamash-valgrind.sh (exit status: 77)

============================================================================
Testsuite summary for GNU datamash 1.4
============================================================================
# TOTAL: 20
# PASS:  17
# SKIP:  2
# XFAIL: 0
# FAIL:  1
# XPASS: 0
# ERROR: 0
============================================================================
See ./test-suite.log
Please report to assafgordon@gmail.com
============================================================================
make[4]: *** [test-suite.log] Error 1
make[4]: Leaving directory `/home/agn/pretest.2018-12-23.l.aaKn/datamash-1.4.Zop8GI/datamash-1.4'
make[3]: *** [check-TESTS] Error 2
make[3]: Leaving directory `/home/agn/pretest.2018-12-23.l.aaKn/datamash-1.4.Zop8GI/datamash-1.4'
make[2]: *** [check-am] Error 2
make[2]: Leaving directory `/home/agn/pretest.2018-12-23.l.aaKn/datamash-1.4.Zop8GI/datamash-1.4'
make[1]: *** [check-recursive] Error 1
make[1]: Leaving directory `/home/agn/pretest.2018-12-23.l.aaKn/datamash-1.4.Zop8GI/datamash-1.4'
make: *** [check] Error 2

Build information

PATH /usr/gnu/bin:/usr/xpg6/bin:/usr/xpg4/bin/:/opt/csw/bin:usr/sfw/bin:/usr/bin:/bin
SHELL /opt/csw/bin/bash
PWD /home/agn/pretest.2018-12-23.l.aaKn/datamash-1.4.Zop8GI
hostname unstable11s
SOURCE https://agnx.s3.amazonaws.com/tmp/datamash-1.4.tar.gz
BASENAME datamash-1.4
configure_extra_params
make_extra_params
make_check_extra_params
env_extra_params
git_branch

Build host information

autoconf-version autoconf (GNU Autoconf) 2.69
automake-version automake (GNU automake) 1.15.1
autopoint-version /usr/bin/autopoint (GNU gettext-tools) 0.16.1
autoreconf-version autoreconf (GNU Autoconf) 2.69
make-version GNU Make 3.82
makeinfo-version texi2any (GNU texinfo) 6.1
git-version git version 2.4.0
wget-version GNU Wget 1.19.4 built on solaris2.10.
rsync-version rsync version 3.1.2 protocol version 31
gcc-version gcc (GCC) 5.5.0
cc-version no-version
uname-s SunOS
uname-r 5.11
uname-m sun4u
uname-p sparc
uname-i SUNW,SPARC-Enterprise
uname-o Solaris
uname-v 11.3
lsb_release-v
lsb_release-i
lsb_release-d
lsb_release-r
lsb_release-c
etc_release Oracle Solaris 11.3 SPARC
etc_issue

Download Log Files

logs/configure.log 17.9 kB curl -JLO 'http://pretest.housegordon.org/g/6081/logs/configure.log'
logs/config.status 76.4 kB curl -JLO 'http://pretest.housegordon.org/g/6081/logs/config.status'
logs/configure.ok 0 Bytes curl -JLO 'http://pretest.housegordon.org/g/6081/logs/configure.ok'
logs/config.log 516.8 kB curl -JLO 'http://pretest.housegordon.org/g/6081/logs/config.log'
logs/config.h 43.9 kB curl -JLO 'http://pretest.housegordon.org/g/6081/logs/config.h'
logs/environment.txt 191 Bytes curl -JLO 'http://pretest.housegordon.org/g/6081/logs/environment.txt'
logs/versions.txt 724 Bytes curl -JLO 'http://pretest.housegordon.org/g/6081/logs/versions.txt'
logs/input.txt 181 Bytes curl -JLO 'http://pretest.housegordon.org/g/6081/logs/input.txt'
logs/tests-suite-summary.log 5.0 kB curl -JLO 'http://pretest.housegordon.org/g/6081/logs/tests-suite-summary.log'
logs/status 18 Bytes curl -JLO 'http://pretest.housegordon.org/g/6081/logs/status'
logs/make-check.log 17.6 kB curl -JLO 'http://pretest.housegordon.org/g/6081/logs/make-check.log'
logs/test-suite.0.log 14.7 kB curl -JLO 'http://pretest.housegordon.org/g/6081/logs/test-suite.0.log'
logs/timestamp.start.txt 76 Bytes curl -JLO 'http://pretest.housegordon.org/g/6081/logs/timestamp.start.txt'
logs/make.log 80.0 kB curl -JLO 'http://pretest.housegordon.org/g/6081/logs/make.log'
logs/make.ok 0 Bytes curl -JLO 'http://pretest.housegordon.org/g/6081/logs/make.ok'
logs/tail-error.log 1.9 kB curl -JLO 'http://pretest.housegordon.org/g/6081/logs/tail-error.log'