Pretest Build Reports - Build 5516 details

For more information see http://pretest.nongnu.org.

← back to list

Project: gawk-4.1.65
Source: http://www.skeeve.com/gawk/gawk-4.1.65.tar.gz
System: GNU 0.7 (i686-AT386)
Status:
make-check failed
Download logs (what's inside?) gawk-4.1.65.pretest-build-report.build-5516.tar.bz2
Last lines of tail-error.log:
make-check failed, tail of make-check.log:

time
make[2]: Leaving directory '/tmp/gawk-4.1.65.GB4feq/gawk-4.1.65/test'
======== Done with shared library tests ========
======== Starting MPFR tests ========
MPFR tests not supported on this system
======== Done with MPFR tests ========
make[2]: Entering directory '/tmp/gawk-4.1.65.GB4feq/gawk-4.1.65/test'
2 TESTS FAILED
Makefile:4572: recipe for target 'pass-fail' failed
make[2]: *** [pass-fail] Error 1
make[2]: Leaving directory '/tmp/gawk-4.1.65.GB4feq/gawk-4.1.65/test'
make[2]: Entering directory '/tmp/gawk-4.1.65.GB4feq/gawk-4.1.65/test'
for i in _* ; \
do  \
if [ "$i" != "_*" ]; then \
echo ============== $i ============= ; \
base=`echo $i | sed 's/^_//'` ; \
if [ -r ${base}.ok ]; then \
diff -c ${base}.ok $i ; \
else \
diff -c "."/${base}.ok  $i ; \
fi ; \
fi ; \
done | more
============== _mbstr1 =============
*** mbstr1.ok	Fri Jun 16 03:19:06 2017
--- _mbstr1	Wed Oct  4 04:09:13 2017
***************
*** 1,3 ****
- gawk: mbstr1.awk:2: warning: Invalid multibyte data detected. There may be a mismatch between your data and your locale.
4
1
--- 1,2 ----
============== _mbstr2 =============
*** mbstr2.ok	Fri Jun 16 03:19:06 2017
--- _mbstr2	Wed Oct  4 04:09:13 2017
***************
*** 1,5 ****
2007
- gawk: mbstr2.awk:1: (FILENAME=- FNR=2) warning: Invalid multibyte data detected. There may be a mismatch between your data and your locale.
2007
2007
2007
--- 1,4 ----
make[2]: Leaving directory '/tmp/gawk-4.1.65.GB4feq/gawk-4.1.65/test'
Makefile:1796: recipe for target 'check' failed
make[1]: *** [check] Error 1
make[1]: Leaving directory '/tmp/gawk-4.1.65.GB4feq/gawk-4.1.65/test'
Makefile:725: recipe for target 'check-recursive' failed
make: *** [check-recursive] Error 1

Build information

PATH /usr/local/bin:/usr/bin:/bin:/usr/games
SHELL /bin/bash
PWD /tmp/gawk-4.1.65.GB4feq
hostname hurd07
SOURCE http://www.skeeve.com/gawk/gawk-4.1.65.tar.gz
BASENAME gawk-4.1.65
configure_extra_params
make_extra_params
make_check_extra_params
env_extra_params
git_branch

Build host information

autoconf-version autoconf (GNU Autoconf) 2.69
automake-version automake (GNU automake) 1.15
autopoint-version /usr/bin/autopoint (GNU gettext-tools) 0.19.7
autoreconf-version autoreconf (GNU Autoconf) 2.69
make-version GNU Make 4.1
makeinfo-version missing
git-version git version 2.6.4
wget-version GNU Wget 1.17.1 built on gnu.
rsync-version rsync version 3.1.1 protocol version 31
gcc-version gcc (Debian 5.3.1-5) 5.3.1 20160101
cc-version cc (Debian 5.3.1-5) 5.3.1 20160101
uname-s GNU
uname-r 0.7
uname-m i686-AT386
uname-p unknown
uname-i unknown
uname-o GNU
uname-v GNU-Mach 1.6+git20160114-486/Hurd-0.7
lsb_release-v
lsb_release-i
lsb_release-d
lsb_release-r
lsb_release-c
etc_release
etc_issue Debian GNU/Hurd stretch/sid \n \l

Download Log Files

logs/timestamp.start.txt 76 Bytes curl -JLO 'http://pretest.housegordon.org/g/5516/logs/timestamp.start.txt'
logs/versions.txt 765 Bytes curl -JLO 'http://pretest.housegordon.org/g/5516/logs/versions.txt'
logs/environment.txt 105 Bytes curl -JLO 'http://pretest.housegordon.org/g/5516/logs/environment.txt'
logs/input.txt 172 Bytes curl -JLO 'http://pretest.housegordon.org/g/5516/logs/input.txt'
logs/configure.log 15.1 kB curl -JLO 'http://pretest.housegordon.org/g/5516/logs/configure.log'
logs/configure.ok 0 Bytes curl -JLO 'http://pretest.housegordon.org/g/5516/logs/configure.ok'
logs/make.log 22.5 kB curl -JLO 'http://pretest.housegordon.org/g/5516/logs/make.log'
logs/make.ok 0 Bytes curl -JLO 'http://pretest.housegordon.org/g/5516/logs/make.ok'
logs/make-check.log 8.7 kB curl -JLO 'http://pretest.housegordon.org/g/5516/logs/make-check.log'
logs/status 18 Bytes curl -JLO 'http://pretest.housegordon.org/g/5516/logs/status'
logs/config.log 129.7 kB curl -JLO 'http://pretest.housegordon.org/g/5516/logs/config.log'
logs/config.status 43.4 kB curl -JLO 'http://pretest.housegordon.org/g/5516/logs/config.status'
logs/config.h 14.5 kB curl -JLO 'http://pretest.housegordon.org/g/5516/logs/config.h'
logs/tail-error.log 1.8 kB curl -JLO 'http://pretest.housegordon.org/g/5516/logs/tail-error.log'