Pretest Build Reports - Build 5502 details

For more information see http://pretest.nongnu.org.

← back to list

Project: gawk-4.1.65
Source: http://www.skeeve.com/gawk/gawk-4.1.65.tar.gz
System: Oracle SunOS 5.11 (i86pc)
Status:
make failed
Download logs (what's inside?) gawk-4.1.65.pretest-build-report.build-5502.tar.bz2
Last lines of tail-error.log:
make failed, tail of make.log:

mv -f .deps/readdir_test.Tpo .deps/readdir_test.Plo
/bin/sh ./libtool  --tag=CC   --mode=link gcc  -g -O2 -DNDEBUG -module -avoid-version -no-undefined -rpath /foo  -o readdir_test.la  readdir_test.lo
libtool: link: gcc -shared  -fPIC -DPIC -Wl,-z -Wl,text -Wl,-h -Wl,readdir_test.so -o .libs/readdir_test.so  .libs/readdir_test.o    -g -O2
libtool: link: ( cd ".libs" && rm -f "readdir_test.la" && ln -s "../readdir_test.la" "readdir_test.la" )
/bin/sh ./libtool  --tag=CC   --mode=compile gcc -DHAVE_CONFIG_H -I.  -I./..   -g -O2 -DNDEBUG -MT testext.lo -MD -MP -MF .deps/testext.Tpo -c -o testext.lo testext.c
libtool: compile:  gcc -DHAVE_CONFIG_H -I. -I./.. -g -O2 -DNDEBUG -MT testext.lo -MD -MP -MF .deps/testext.Tpo -c testext.c  -fPIC -DPIC -o .libs/testext.o
mv -f .deps/testext.Tpo .deps/testext.Plo
/bin/sh ./libtool  --tag=CC   --mode=link gcc  -g -O2 -DNDEBUG -module -avoid-version -no-undefined -rpath /foo  -o testext.la  testext.lo
libtool: link: gcc -shared  -fPIC -DPIC -Wl,-z -Wl,text -Wl,-h -Wl,testext.so -o .libs/testext.so  .libs/testext.o    -g -O2
libtool: link: ( cd ".libs" && rm -f "testext.la" && ln -s "../testext.la" "testext.la" )
/bin/sh ./libtool  --tag=CC   --mode=compile gcc -DHAVE_CONFIG_H -I.  -I./..   -g -O2 -DNDEBUG -MT filefuncs.lo -MD -MP -MF .deps/filefuncs.Tpo -c -o filefuncs.lo filefuncs.c
libtool: compile:  gcc -DHAVE_CONFIG_H -I. -I./.. -g -O2 -DNDEBUG -MT filefuncs.lo -MD -MP -MF .deps/filefuncs.Tpo -c filefuncs.c  -fPIC -DPIC -o .libs/filefuncs.o
mv -f .deps/filefuncs.Tpo .deps/filefuncs.Plo
/bin/sh ./libtool  --tag=CC   --mode=compile gcc -DHAVE_CONFIG_H -I.  -I./..   -g -O2 -DNDEBUG -MT stack.lo -MD -MP -MF .deps/stack.Tpo -c -o stack.lo stack.c
libtool: compile:  gcc -DHAVE_CONFIG_H -I. -I./.. -g -O2 -DNDEBUG -MT stack.lo -MD -MP -MF .deps/stack.Tpo -c stack.c  -fPIC -DPIC -o .libs/stack.o
mv -f .deps/stack.Tpo .deps/stack.Plo
/bin/sh ./libtool  --tag=CC   --mode=compile gcc -DHAVE_CONFIG_H -I.  -I./..   -g -O2 -DNDEBUG -MT gawkfts.lo -MD -MP -MF .deps/gawkfts.Tpo -c -o gawkfts.lo gawkfts.c
libtool: compile:  gcc -DHAVE_CONFIG_H -I. -I./.. -g -O2 -DNDEBUG -MT gawkfts.lo -MD -MP -MF .deps/gawkfts.Tpo -c gawkfts.c  -fPIC -DPIC -o .libs/gawkfts.o
mv -f .deps/gawkfts.Tpo .deps/gawkfts.Plo
/bin/sh ./libtool  --tag=CC   --mode=link gcc  -g -O2 -DNDEBUG -module -avoid-version -no-undefined  -o filefuncs.la -rpath /usr/local/lib/gawk filefuncs.lo stack.lo gawkfts.lo
libtool: link: gcc -shared  -fPIC -DPIC -Wl,-z -Wl,text -Wl,-h -Wl,filefuncs.so -o .libs/filefuncs.so  .libs/filefuncs.o .libs/stack.o .libs/gawkfts.o    -g -O2
libtool: link: ( cd ".libs" && rm -f "filefuncs.la" && ln -s "../filefuncs.la" "filefuncs.la" )
/bin/sh ./libtool  --tag=CC   --mode=compile gcc -DHAVE_CONFIG_H -I.  -I./..   -g -O2 -DNDEBUG -MT fnmatch.lo -MD -MP -MF .deps/fnmatch.Tpo -c -o fnmatch.lo fnmatch.c
libtool: compile:  gcc -DHAVE_CONFIG_H -I. -I./.. -g -O2 -DNDEBUG -MT fnmatch.lo -MD -MP -MF .deps/fnmatch.Tpo -c fnmatch.c  -fPIC -DPIC -o .libs/fnmatch.o
mv -f .deps/fnmatch.Tpo .deps/fnmatch.Plo
/bin/sh ./libtool  --tag=CC   --mode=link gcc  -g -O2 -DNDEBUG -module -avoid-version -no-undefined  -o fnmatch.la -rpath /usr/local/lib/gawk fnmatch.lo
libtool: link: gcc -shared  -fPIC -DPIC -Wl,-z -Wl,text -Wl,-h -Wl,fnmatch.so -o .libs/fnmatch.so  .libs/fnmatch.o    -g -O2
libtool: link: ( cd ".libs" && rm -f "fnmatch.la" && ln -s "../fnmatch.la" "fnmatch.la" )
/bin/sh ./libtool  --tag=CC   --mode=compile gcc -DHAVE_CONFIG_H -I.  -I./..   -g -O2 -DNDEBUG -MT fork.lo -MD -MP -MF .deps/fork.Tpo -c -o fork.lo fork.c
libtool: compile:  gcc -DHAVE_CONFIG_H -I. -I./.. -g -O2 -DNDEBUG -MT fork.lo -MD -MP -MF .deps/fork.Tpo -c fork.c  -fPIC -DPIC -o .libs/fork.o
mv -f .deps/fork.Tpo .deps/fork.Plo
/bin/sh ./libtool  --tag=CC   --mode=link gcc  -g -O2 -DNDEBUG -module -avoid-version -no-undefined  -o fork.la -rpath /usr/local/lib/gawk fork.lo
libtool: link: gcc -shared  -fPIC -DPIC -Wl,-z -Wl,text -Wl,-h -Wl,fork.so -o .libs/fork.so  .libs/fork.o    -g -O2
libtool: link: ( cd ".libs" && rm -f "fork.la" && ln -s "../fork.la" "fork.la" )
/bin/sh ./libtool  --tag=CC   --mode=compile gcc -DHAVE_CONFIG_H -I.  -I./..   -g -O2 -DNDEBUG -MT inplace.lo -MD -MP -MF .deps/inplace.Tpo -c -o inplace.lo inplace.c
libtool: compile:  gcc -DHAVE_CONFIG_H -I. -I./.. -g -O2 -DNDEBUG -MT inplace.lo -MD -MP -MF .deps/inplace.Tpo -c inplace.c  -fPIC -DPIC -o .libs/inplace.o
In file included from /usr/include/stdio.h:15:0,
from inplace.c:37:
/opt/csw/lib/gcc/i386-pc-solaris2.10/5.2.0/include-fixed/sys/feature_tests.h:346:2: error: #error "Compiler or options invalid for pre-UNIX 03 X/Open applications 	and pre-2001 POSIX applications"
#error "Compiler or options invalid for pre-UNIX 03 X/Open applications \
^
make[4]: *** [inplace.lo] Error 1
make[4]: Leaving directory `/home/agn/pretest.2017-10-04.P3aa.x/gawk-4.1.65.nfv2NU/gawk-4.1.65/extension'
make[3]: *** [all-recursive] Error 1
make[3]: Leaving directory `/home/agn/pretest.2017-10-04.P3aa.x/gawk-4.1.65.nfv2NU/gawk-4.1.65/extension'
make[2]: *** [all] Error 2
make[2]: Leaving directory `/home/agn/pretest.2017-10-04.P3aa.x/gawk-4.1.65.nfv2NU/gawk-4.1.65/extension'
make[1]: *** [all-recursive] Error 1
make[1]: Leaving directory `/home/agn/pretest.2017-10-04.P3aa.x/gawk-4.1.65.nfv2NU/gawk-4.1.65'
make: *** [all] Error 2

Build information

PATH /usr/gnu/bin:/usr/xpg6/bin:/usr/xpg4/bin/:/opt/csw/bin:usr/sfw/bin:/usr/bin:/bin
SHELL /opt/csw/bin/bash
PWD /home/agn/pretest.2017-10-04.P3aa.x/gawk-4.1.65.nfv2NU
hostname unstable11x
SOURCE http://www.skeeve.com/gawk/gawk-4.1.65.tar.gz
BASENAME gawk-4.1.65
configure_extra_params
make_extra_params
make_check_extra_params
env_extra_params
git_branch

Build host information

autoconf-version autoconf (GNU Autoconf) 2.69
automake-version automake (GNU automake) 1.15
autopoint-version /usr/bin/autopoint (GNU gettext-tools) 0.16.1
autoreconf-version autoreconf (GNU Autoconf) 2.69
make-version GNU Make 3.82
makeinfo-version texi2any (GNU texinfo) 6.1
git-version git version 2.4.0
wget-version GNU Wget 1.19.1 built on solaris2.10.
rsync-version rsync version 3.1.2 protocol version 31
gcc-version gcc (GCC) 5.2.0
cc-version missing
uname-s SunOS
uname-r 5.11
uname-m i86pc
uname-p i386
uname-i i86pc
uname-o Solaris
uname-v 11.2
lsb_release-v
lsb_release-i
lsb_release-d
lsb_release-r
lsb_release-c
etc_release Oracle Solaris 11.2 X86
etc_issue

Download Log Files

logs/config.status 43.8 kB curl -JLO 'http://pretest.housegordon.org/g/5502/logs/config.status'
logs/configure.log 15.6 kB curl -JLO 'http://pretest.housegordon.org/g/5502/logs/configure.log'
logs/config.h 14.5 kB curl -JLO 'http://pretest.housegordon.org/g/5502/logs/config.h'
logs/config.log 151.1 kB curl -JLO 'http://pretest.housegordon.org/g/5502/logs/config.log'
logs/timestamp.start.txt 76 Bytes curl -JLO 'http://pretest.housegordon.org/g/5502/logs/timestamp.start.txt'
logs/environment.txt 190 Bytes curl -JLO 'http://pretest.housegordon.org/g/5502/logs/environment.txt'
logs/configure.ok 0 Bytes curl -JLO 'http://pretest.housegordon.org/g/5502/logs/configure.ok'
logs/status 12 Bytes curl -JLO 'http://pretest.housegordon.org/g/5502/logs/status'
logs/make.log 15.5 kB curl -JLO 'http://pretest.housegordon.org/g/5502/logs/make.log'
logs/input.txt 172 Bytes curl -JLO 'http://pretest.housegordon.org/g/5502/logs/input.txt'
logs/versions.txt 700 Bytes curl -JLO 'http://pretest.housegordon.org/g/5502/logs/versions.txt'
logs/tail-error.log 5.4 kB curl -JLO 'http://pretest.housegordon.org/g/5502/logs/tail-error.log'