Pretest Build Reports - Build 5454 details

For more information see http://pretest.nongnu.org.

← back to list

Project: texinfo-6.4.92
Source: http://alpha.gnu.org/gnu/texinfo/texinfo-6.4.92.tar.xz
System: Unknown SunOS 5.11 (i86pc)
Status:
make-check failed
Download logs (what's inside?) texinfo-6.4.92.pretest-build-report.build-5454.tar.bz2
Failed tests from tests-suite-summary.log:
==================================================================
GNU Texinfo 6.4.92: tp/tests/many_input_files/test-suite.log
==================================================================

# TOTAL: 3
# PASS:  1
# SKIP:  2
# XFAIL: 0
# FAIL:  0
# XPASS: 0
# ERROR: 0

=================================================
GNU Texinfo 6.4.92: tp/tests/test-suite.log
=================================================

# TOTAL: 184
# PASS:  171
# SKIP:  13
# XFAIL: 0
# FAIL:  0
# XPASS: 0
# ERROR: 0

===========================================
GNU Texinfo 6.4.92: tp/test-suite.log
===========================================

# TOTAL: 0
# PASS:  0
# SKIP:  0
# XFAIL: 0
# FAIL:  0
# XPASS: 0
# ERROR: 0

===========================================================
GNU Texinfo 6.4.92: Pod-Simple-Texinfo/test-suite.log
===========================================================

# TOTAL: 0
# PASS:  0
# SKIP:  0
# XFAIL: 0
# FAIL:  0
# XPASS: 0
# ERROR: 0

=================================================
GNU Texinfo 6.4.92: texindex/test-suite.log
=================================================

# TOTAL: 1
# PASS:  0
# SKIP:  0
# XFAIL: 0
# FAIL:  1
# XPASS: 0
# ERROR: 0

FAIL: tests/ti-helpversion.sh
=============================

+ SHELL=/bin/sh
+ export SHELL
+ CDPATH=''
+ unset CDPATH
+ test -z .
+ texindex=./texindex
+ TEXINDEX_SCRIPT=./texindex.awk
+ export TEXINDEX_SCRIPT
+ ./texindex --version
nawk: newline in string Email bug ... at source line 139 in function usage
context is
print _"Email bug reports to bug-texinfo@gnu.org,\n\ >>>
<<< general questions and discussion to help-texinfo@gnu.org.\n\
nawk: syntax error at source line 140 in function usage
nawk: illegal statement at source line 140 in function usage
+ out=''
+ test 2 -ne 0
+ echo './tests/ti-helpversion.sh: ./texindex --version failed.'
+ 1>& 2
./tests/ti-helpversion.sh: ./texindex --version failed.
+ exit 1
FAIL tests/ti-helpversion.sh (exit status: 1)

===========================================================
GNU Texinfo 6.4.92: install-info/tests/test-suite.log
===========================================================

# TOTAL: 57
# PASS:  55
# SKIP:  2
# XFAIL: 0
# FAIL:  0
# XPASS: 0
# ERROR: 0

=============================================
GNU Texinfo 6.4.92: info/test-suite.log
=============================================

# TOTAL: 83
# PASS:  83
# SKIP:  0
# XFAIL: 0
# FAIL:  0
# XPASS: 0
# ERROR: 0
Last lines of tail-error.log:
make-check failed, tail of make-check.log:


.. contents:: :depth: 2

FAIL: tests/ti-helpversion.sh
=============================

+ SHELL=/bin/sh
+ export SHELL
+ CDPATH=''
+ unset CDPATH
+ test -z .
+ texindex=./texindex
+ TEXINDEX_SCRIPT=./texindex.awk
+ export TEXINDEX_SCRIPT
+ ./texindex --version
nawk: newline in string Email bug ... at source line 139 in function usage
context is
print _"Email bug reports to bug-texinfo@gnu.org,\n\ >>>
<<< general questions and discussion to help-texinfo@gnu.org.\n\
nawk: syntax error at source line 140 in function usage
nawk: illegal statement at source line 140 in function usage
+ out=''
+ test 2 -ne 0
+ echo './tests/ti-helpversion.sh: ./texindex --version failed.'
+ 1>& 2
./tests/ti-helpversion.sh: ./texindex --version failed.
+ exit 1
FAIL tests/ti-helpversion.sh (exit status: 1)

============================================================================
Testsuite summary for GNU Texinfo 6.4.92
============================================================================
# TOTAL: 1
# PASS:  0
# SKIP:  0
# XFAIL: 0
# FAIL:  1
# XPASS: 0
# ERROR: 0
============================================================================
See texindex/test-suite.log
Please report to bug-texinfo@gnu.org
============================================================================
make[3]: *** [test-suite.log] Error 1
make[3]: Leaving directory `/tmp/texinfo-6.4.92.aW8PXn/texinfo-6.4.92/texindex'
make[2]: *** [check-TESTS] Error 2
make[2]: Leaving directory `/tmp/texinfo-6.4.92.aW8PXn/texinfo-6.4.92/texindex'
make[1]: *** [check-am] Error 2
make[1]: Leaving directory `/tmp/texinfo-6.4.92.aW8PXn/texinfo-6.4.92/texindex'
make: *** [check-recursive] Error 1

Build information

PATH /usr/gnu/bin:/usr/xpg6/bin:/usr/xpg4/bin/:/opt/csw/bin:usr/sfw/bin:/usr/bin:/sbin:/usr/sbin:/usr/gnu/bin:/usr/gnu/sbin:/usr/local/bin:/usr/local/sbin
SHELL /bin/bash
PWD /tmp/texinfo-6.4.92.aW8PXn
hostname dilos137
SOURCE http://alpha.gnu.org/gnu/texinfo/texinfo-6.4.92.tar.xz
BASENAME texinfo-6.4.92
configure_extra_params
make_extra_params
make_check_extra_params
env_extra_params
git_branch

Build host information

autoconf-version autoconf (GNU Autoconf) 2.69
automake-version automake (GNU automake) 1.14
autopoint-version /usr/bin/autopoint (GNU gettext-tools) 0.18.3
autoreconf-version autoreconf (GNU Autoconf) 2.69
make-version GNU Make 3.82
makeinfo-version makeinfo (GNU texinfo) 4.7
git-version git version 1.9.4
wget-version GNU Wget 1.14 built on solaris2.11.
rsync-version rsync version 3.0.9 protocol version 30
gcc-version gcc (GCC) 4.8.3
cc-version missing
uname-s SunOS
uname-r 5.11
uname-m i86pc
uname-p i386
uname-i i86pc
uname-o
uname-v 1.3.7
lsb_release-v
lsb_release-i
lsb_release-d
lsb_release-r
lsb_release-c
etc_release DilOS 1.3 (based on illumos)
etc_issue DilOS (based on illumos) Version 1.3.7.18 2014-09-19

Download Log Files

logs/timestamp.start.txt 76 Bytes curl -JLO 'http://pretest.housegordon.org/g/5454/logs/timestamp.start.txt'
logs/versions.txt 752 Bytes curl -JLO 'http://pretest.housegordon.org/g/5454/logs/versions.txt'
logs/environment.txt 220 Bytes curl -JLO 'http://pretest.housegordon.org/g/5454/logs/environment.txt'
logs/input.txt 184 Bytes curl -JLO 'http://pretest.housegordon.org/g/5454/logs/input.txt'
logs/configure.log 29.3 kB curl -JLO 'http://pretest.housegordon.org/g/5454/logs/configure.log'
logs/configure.ok 0 Bytes curl -JLO 'http://pretest.housegordon.org/g/5454/logs/configure.ok'
logs/make.log 78.6 kB curl -JLO 'http://pretest.housegordon.org/g/5454/logs/make.log'
logs/make.ok 0 Bytes curl -JLO 'http://pretest.housegordon.org/g/5454/logs/make.ok'
logs/make-check.log 24.0 kB curl -JLO 'http://pretest.housegordon.org/g/5454/logs/make-check.log'
logs/status 18 Bytes curl -JLO 'http://pretest.housegordon.org/g/5454/logs/status'
logs/config.log 591.1 kB curl -JLO 'http://pretest.housegordon.org/g/5454/logs/config.log'
logs/config.status 74.7 kB curl -JLO 'http://pretest.housegordon.org/g/5454/logs/config.status'
logs/config.h 54.3 kB curl -JLO 'http://pretest.housegordon.org/g/5454/logs/config.h'
logs/test-suite.0.log 574 Bytes curl -JLO 'http://pretest.housegordon.org/g/5454/logs/test-suite.0.log'
logs/tests-suite-summary.log 2.4 kB curl -JLO 'http://pretest.housegordon.org/g/5454/logs/tests-suite-summary.log'
logs/test-suite.1.log 3.0 kB curl -JLO 'http://pretest.housegordon.org/g/5454/logs/test-suite.1.log'
logs/test-suite.2.log 233 Bytes curl -JLO 'http://pretest.housegordon.org/g/5454/logs/test-suite.2.log'
logs/test-suite.3.log 281 Bytes curl -JLO 'http://pretest.housegordon.org/g/5454/logs/test-suite.3.log'
logs/test-suite.4.log 1.0 kB curl -JLO 'http://pretest.housegordon.org/g/5454/logs/test-suite.4.log'
logs/test-suite.5.log 4.2 kB curl -JLO 'http://pretest.housegordon.org/g/5454/logs/test-suite.5.log'
logs/test-suite.6.log 241 Bytes curl -JLO 'http://pretest.housegordon.org/g/5454/logs/test-suite.6.log'
logs/tail-error.log 1.7 kB curl -JLO 'http://pretest.housegordon.org/g/5454/logs/tail-error.log'