Pretest Build Reports - Build 4917 details

For more information see http://pretest.nongnu.org.

← back to list

Project: util-linux-2.30-rc2-22-3947
Source: http://files.housegordon.org/tmp/util-linux-2.30-rc2-22-3947.tar.xz
System: OpenBSD 5.6 (amd64)
Status:
make failed
Download logs (what's inside?) util-linux-2.30-rc2-22-3947.pretest-build-report.build-4917.tar.bz2
Last lines of tail-error.log:
make failed, tail of make.log:

CC       lib/libcommon_la-fileutils.lo
In file included from lib/fileutils.c:8:
/usr/include/unistd.h:368: warning: redundant redeclaration of 'lseek'
/usr/include/sys/types.h:214: warning: previous declaration of 'lseek' was here
/usr/include/unistd.h:404: warning: redundant redeclaration of 'ftruncate'
/usr/include/sys/types.h:215: warning: previous declaration of 'ftruncate' was here
/usr/include/unistd.h:424: warning: redundant redeclaration of 'mkstemp'
/usr/include/stdlib.h:212: warning: previous declaration of 'mkstemp' was here
/usr/include/unistd.h:425: warning: redundant redeclaration of 'mktemp'
/usr/include/stdlib.h:180: warning: previous declaration of 'mktemp' was here
/usr/include/unistd.h:429: warning: redundant redeclaration of 'setkey'
/usr/include/stdlib.h:197: warning: previous declaration of 'setkey' was here
/usr/include/unistd.h:435: warning: redundant redeclaration of 'truncate'
/usr/include/sys/types.h:216: warning: previous declaration of 'truncate' was here
/usr/include/unistd.h:507: warning: redundant redeclaration of 'mkdtemp'
/usr/include/stdlib.h:252: warning: previous declaration of 'mkdtemp' was here
/usr/include/unistd.h:508: warning: redundant redeclaration of 'mkstemps'
/usr/include/stdlib.h:287: warning: previous declaration of 'mkstemps' was here
CC       lib/libcommon_la-ismounted.lo
In file included from lib/ismounted.c:10:
/usr/include/unistd.h:368: warning: redundant redeclaration of 'lseek'
/usr/include/sys/types.h:214: warning: previous declaration of 'lseek' was here
/usr/include/unistd.h:404: warning: redundant redeclaration of 'ftruncate'
/usr/include/sys/types.h:215: warning: previous declaration of 'ftruncate' was here
/usr/include/unistd.h:435: warning: redundant redeclaration of 'truncate'
/usr/include/sys/types.h:216: warning: previous declaration of 'truncate' was here
In file included from lib/ismounted.c:11:
/usr/include/stdlib.h:180: warning: redundant redeclaration of 'mktemp'
/usr/include/unistd.h:425: warning: previous declaration of 'mktemp' was here
/usr/include/stdlib.h:197: warning: redundant redeclaration of 'setkey'
/usr/include/unistd.h:429: warning: previous declaration of 'setkey' was here
/usr/include/stdlib.h:212: warning: redundant redeclaration of 'mkstemp'
/usr/include/unistd.h:424: warning: previous declaration of 'mkstemp' was here
/usr/include/stdlib.h:252: warning: redundant redeclaration of 'mkdtemp'
/usr/include/unistd.h:507: warning: previous declaration of 'mkdtemp' was here
/usr/include/stdlib.h:287: warning: redundant redeclaration of 'mkstemps'
/usr/include/unistd.h:508: warning: previous declaration of 'mkstemps' was here
lib/ismounted.c: In function 'check_getmntinfo':
lib/ismounted.c:222: warning: implicit declaration of function 'getmntinfo'
lib/ismounted.c:222: warning: nested extern declaration of 'getmntinfo'
lib/ismounted.c:222: error: 'MNT_NOWAIT' undeclared (first use in this function)
lib/ismounted.c:222: error: (Each undeclared identifier is reported only once
lib/ismounted.c:222: error: for each function it appears in.)
lib/ismounted.c:233: error: dereferencing pointer to incomplete type
lib/ismounted.c:242: error: increment of pointer to unknown structure
lib/ismounted.c:242: error: arithmetic on pointer to an incomplete type
lib/ismounted.c:245: error: dereferencing pointer to incomplete type
*** Error 1 in . (Makefile:8350 'lib/libcommon_la-ismounted.lo': @echo "  CC      " lib/libcommon_la-ismounted.lo;/bin/sh ./libtool --silent...)
*** Error 1 in . (Makefile:11731 'all-recursive')
*** Error 1 in /tmp/util-linux-2.30-rc2-22-3947.SgYNq5/util-linux-2.30-rc2-22-3947 (Makefile:4900 'all')

Build information

PATH /usr/bin:/bin:/usr/sbin:/sbin:/usr/X11R6/bin:/usr/local/bin:/usr/local/sbin
SHELL /bin/ksh
PWD /tmp/util-linux-2.30-rc2-22-3947.SgYNq5
hostname openbsd56.my.domain
SOURCE http://files.housegordon.org/tmp/util-linux-2.30-rc2-22-3947.tar.xz
BASENAME util-linux-2.30-rc2-22-3947
configure_extra_params
make_extra_params
make_check_extra_params
env_extra_params
git_branch

Build host information

autoconf-version no-version
automake-version no-version
autopoint-version /usr/local/bin/autopoint (GNU gettext-tools) 0.19.1
autoreconf-version no-version
make-version no-version
makeinfo-version makeinfo (GNU texinfo) 4.8
git-version git version 1.9.3
wget-version GNU Wget 1.15 built on openbsd5.6.
rsync-version rsync version 3.1.1 protocol version 31
gcc-version gcc (GCC) 4.2.1 20070719
cc-version cc (GCC) 4.2.1 20070719
uname-s OpenBSD
uname-r 5.6
uname-m amd64
uname-p amd64
uname-i
uname-o
uname-v GENERIC#310
lsb_release-v
lsb_release-i
lsb_release-d
lsb_release-r
lsb_release-c
etc_release
etc_issue

Download Log Files

logs/timestamp.start.txt 76 Bytes curl -JLO 'http://pretest.housegordon.org/g/4917/logs/timestamp.start.txt'
logs/versions.txt 645 Bytes curl -JLO 'http://pretest.housegordon.org/g/4917/logs/versions.txt'
logs/environment.txt 169 Bytes curl -JLO 'http://pretest.housegordon.org/g/4917/logs/environment.txt'
logs/input.txt 210 Bytes curl -JLO 'http://pretest.housegordon.org/g/4917/logs/input.txt'
logs/configure.log 26.0 kB curl -JLO 'http://pretest.housegordon.org/g/4917/logs/configure.log'
logs/configure.ok 0 Bytes curl -JLO 'http://pretest.housegordon.org/g/4917/logs/configure.ok'
logs/make.log 9.2 kB curl -JLO 'http://pretest.housegordon.org/g/4917/logs/make.log'
logs/status 12 Bytes curl -JLO 'http://pretest.housegordon.org/g/4917/logs/status'
logs/config.log 476.6 kB curl -JLO 'http://pretest.housegordon.org/g/4917/logs/config.log'
logs/config.status 83.6 kB curl -JLO 'http://pretest.housegordon.org/g/4917/logs/config.status'
logs/config.h 23.2 kB curl -JLO 'http://pretest.housegordon.org/g/4917/logs/config.h'
logs/tail-error.log 3.7 kB curl -JLO 'http://pretest.housegordon.org/g/4917/logs/tail-error.log'