Pretest Build Reports - Build 4915 details

For more information see http://pretest.nongnu.org.

← back to list

Project: util-linux-2.30-rc2-22-3947
Source: http://files.housegordon.org/tmp/util-linux-2.30-rc2-22-3947.tar.xz
System: gNewSense 3.0 (x86_64)
Status:
make-check failed
Download logs (what's inside?) util-linux-2.30-rc2-22-3947.pretest-build-report.build-4915.tar.bz2
Last lines of tail-error.log:
make-check failed, tail of make-check.log:

schedutils: cpuset                         ... OK
script: buffering race                 ... OK
script: options                        ...
: append                      ... OK
: force                       ... OK
: quiet                       ... OK
: return                      ... OK
... OK (all 4 sub-tests PASSED)
script: race conditions                ... OK
script: replay                         ... OK
sfdisk: MBR                            ... SKIPPED (no root permissions)
sfdisk: GPT                            ... SKIPPED (no root permissions)
sfdisk: movedata                       ... SKIPPED (no root permissions)
sfdisk: resize                         ... SKIPPED (no root permissions)
sfdisk: GPT                            ... SKIPPED (no root permissions)
sfdisk: wipe                           ... SKIPPED (no root permissions)
swapon: by devname                     ... SKIPPED (no root permissions)
swapon: fix page size                  ... SKIPPED (no root permissions)
swapon: fix signature                  ... SKIPPED (no root permissions)
swapon: by label                       ... SKIPPED (no root permissions)
swapon: by uuid                        ... SKIPPED (no root permissions)
utmp: last                           ...
: dns                         ... OK
: nodns                       ... OK
... OK (all 2 sub-tests PASSED)
utmp: last ipv6                      ...
: dns                         ... OK
: nodns                       ... OK
... OK (all 2 sub-tests PASSED)
utmp: circle                         ... OK
utmp: subsecond                      ... OK
utmp: to binary                      ... OK
utmp: IPv6 to binary                 ... OK
utmp: to text                        ... OK
utmp: IPv6 to text                   ... OK
uuid: uuidd                          ... OK
uuid: uuidgen                        ... OK
uuid: uuid_parser                    ... OK
wipefs: wipefs                         ... SKIPPED (no root permissions)

---------------------------------------------------------------------
1 tests of 192 FAILED
---------------------------------------------------------------------
make[3]: *** [check-local-tests] Error 1
make[3]: Leaving directory `/tmp/util-linux-2.30-rc2-22-3947.7m6kw7/util-linux-2.30-rc2-22-3947'
make[2]: *** [check-am] Error 2
make[2]: Leaving directory `/tmp/util-linux-2.30-rc2-22-3947.7m6kw7/util-linux-2.30-rc2-22-3947'
make[1]: *** [check-recursive] Error 1
make[1]: Leaving directory `/tmp/util-linux-2.30-rc2-22-3947.7m6kw7/util-linux-2.30-rc2-22-3947'
make: *** [check] Error 2

Build information

PATH /usr/local/bin:/usr/bin:/bin:/usr/bin/X11:/usr/games
SHELL /bin/bash
PWD /tmp/util-linux-2.30-rc2-22-3947.7m6kw7
hostname gnewsense31
SOURCE http://files.housegordon.org/tmp/util-linux-2.30-rc2-22-3947.tar.xz
BASENAME util-linux-2.30-rc2-22-3947
configure_extra_params
make_extra_params
make_check_extra_params
env_extra_params
git_branch

Build host information

autoconf-version autoconf (GNU Autoconf) 2.67
automake-version automake (GNU automake) 1.11.1
autopoint-version /usr/bin/autopoint (GNU gettext-tools) 0.18.1
autoreconf-version autoreconf (GNU Autoconf) 2.67
make-version GNU Make 3.81
makeinfo-version makeinfo (GNU texinfo) 4.13
git-version git version 1.7.2.5
wget-version GNU Wget 1.12 built on linux-gnu.
rsync-version rsync version 3.0.7 protocol version 30
gcc-version gcc (Debian 4.4.5-8) 4.4.5
cc-version cc (Debian 4.4.5-8) 4.4.5
uname-s Linux
uname-r 2.6.32-5gnewsense1-amd64
uname-m x86_64
uname-p unknown
uname-i unknown
uname-o GNU/Linux
uname-v #1 SMP Sun Oct 6 10:04:36 UTC 2013
lsb_release-v
lsb_release-i gNewSense
lsb_release-d gNewSense GNU/Linux 3.0 (parkes)
lsb_release-r 3.0
lsb_release-c parkes
etc_release
etc_issue gNewSense GNU/Linux 3.0 \n \l

Download Log Files

logs/config.h 23.1 kB curl -JLO 'http://pretest.housegordon.org/g/4915/logs/config.h'
logs/config.log 390.6 kB curl -JLO 'http://pretest.housegordon.org/g/4915/logs/config.log'
logs/configure.log 22.0 kB curl -JLO 'http://pretest.housegordon.org/g/4915/logs/configure.log'
logs/timestamp.start.txt 76 Bytes curl -JLO 'http://pretest.housegordon.org/g/4915/logs/timestamp.start.txt'
logs/tail-error.log 3.0 kB curl -JLO 'http://pretest.housegordon.org/g/4915/logs/tail-error.log'
logs/versions.txt 849 Bytes curl -JLO 'http://pretest.housegordon.org/g/4915/logs/versions.txt'
logs/configure.ok 0 Bytes curl -JLO 'http://pretest.housegordon.org/g/4915/logs/configure.ok'
logs/input.txt 210 Bytes curl -JLO 'http://pretest.housegordon.org/g/4915/logs/input.txt'
logs/make-check.log 37.6 kB curl -JLO 'http://pretest.housegordon.org/g/4915/logs/make-check.log'
logs/make.ok 0 Bytes curl -JLO 'http://pretest.housegordon.org/g/4915/logs/make.ok'
logs/environment.txt 139 Bytes curl -JLO 'http://pretest.housegordon.org/g/4915/logs/environment.txt'
logs/config.status 85.8 kB curl -JLO 'http://pretest.housegordon.org/g/4915/logs/config.status'
logs/status 18 Bytes curl -JLO 'http://pretest.housegordon.org/g/4915/logs/status'
logs/make.log 18.2 kB curl -JLO 'http://pretest.housegordon.org/g/4915/logs/make.log'