Pretest Build Reports - Build 4907 details

For more information see http://pretest.nongnu.org.

← back to list

Project: util-linux-2.30-rc2-22-3947
Source: http://files.housegordon.org/tmp/util-linux-2.30-rc2-22-3947.tar.xz
System: kFreeBSD 9.0-2-amd64/Debian 7.8 (x86_64)
Status:
make-check failed
Download logs (what's inside?) util-linux-2.30-rc2-22-3947.pretest-build-report.build-4907.tar.bz2
Last lines of tail-error.log:
make-check failed, tail of make-check.log:

rename: symlink check                  ... OK
schedutils: chrt                           ... SKIPPED (no root permissions)
schedutils: chrt-non-user                  ...
: batch-vs-nice               ... SKIPPED (unsupported)
... OK (all 1 sub-tests PASSED)
schedutils: cpuset                         ... SKIPPED (test_cpuset not found)
script: buffering race                 ... SKIPPED (script not found)
script: options                        ... SKIPPED (test_script not found)
script: race conditions                ... SKIPPED (script not found)
script: replay                         ... SKIPPED (script not found)
sfdisk: MBR                            ... SKIPPED (no root permissions)
sfdisk: GPT                            ... SKIPPED (no root permissions)
sfdisk: movedata                       ... SKIPPED (no root permissions)
sfdisk: resize                         ... SKIPPED (no root permissions)
sfdisk: GPT                            ... SKIPPED (no root permissions)
sfdisk: wipe                           ... SKIPPED (no root permissions)
swapon: by devname                     ... SKIPPED (swapon not found)
swapon: fix page size                  ... SKIPPED (swapon not found)
swapon: fix signature                  ... SKIPPED (swapon not found)
swapon: by label                       ... SKIPPED (swapon not found)
swapon: by uuid                        ... SKIPPED (swapon not found)
utmp: last                           ...
: dns                         ... OK
: nodns                       ... OK
... OK (all 2 sub-tests PASSED)
utmp: last ipv6                      ...
: dns                         ... OK
: nodns                       ... OK
... OK (all 2 sub-tests PASSED)
utmp: circle                         ... OK
utmp: subsecond                      ... OK
utmp: to binary                      ... OK
utmp: IPv6 to binary                 ... OK
utmp: to text                        ... OK
utmp: IPv6 to text                   ... OK
uuid: uuidd                          ... SKIPPED (uuidd not found)
uuid: uuidgen                        ... OK
uuid: uuid_parser                    ... OK
wipefs: wipefs                         ... SKIPPED (no root permissions)

---------------------------------------------------------------------
1 tests of 192 FAILED
---------------------------------------------------------------------
make[3]: *** [check-local-tests] Error 1
make[3]: Leaving directory `/tmp/util-linux-2.30-rc2-22-3947.v05OGv/util-linux-2.30-rc2-22-3947'
make[2]: *** [check-am] Error 2
make[2]: Leaving directory `/tmp/util-linux-2.30-rc2-22-3947.v05OGv/util-linux-2.30-rc2-22-3947'
make[1]: *** [check-recursive] Error 1
make[1]: Leaving directory `/tmp/util-linux-2.30-rc2-22-3947.v05OGv/util-linux-2.30-rc2-22-3947'
make: *** [check] Error 2

Build information

PATH /usr/local/bin:/usr/bin:/bin:/usr/bin/X11:/usr/games
SHELL /bin/bash
PWD /tmp/util-linux-2.30-rc2-22-3947.v05OGv
hostname deb-kfbsd7
SOURCE http://files.housegordon.org/tmp/util-linux-2.30-rc2-22-3947.tar.xz
BASENAME util-linux-2.30-rc2-22-3947
configure_extra_params
make_extra_params
make_check_extra_params
env_extra_params
git_branch

Build host information

autoconf-version autoconf (GNU Autoconf) 2.69
automake-version automake (GNU automake) 1.11.6
autopoint-version /usr/bin/autopoint (GNU gettext-tools) 0.18.1
autoreconf-version autoreconf (GNU Autoconf) 2.69
make-version GNU Make 3.81
makeinfo-version makeinfo (GNU texinfo) 4.13
git-version git version 1.7.10.4
wget-version GNU Wget 1.13.4 built on kfreebsd-gnu.
rsync-version rsync version 3.0.9 protocol version 30
gcc-version gcc (Debian 4.7.2-5) 4.7.2
cc-version cc (Debian 4.7.2-5) 4.7.2
uname-s GNU/kFreeBSD
uname-r 9.0-2-amd64
uname-m x86_64
uname-p amd64
uname-i QEMU Virtual CPU version 2.0.0
uname-o GNU/kFreeBSD
uname-v #0 Wed Feb 25 13:42:52 UTC 2015
lsb_release-v
lsb_release-i Debian
lsb_release-d Debian GNU/kFreeBSD 7.8 (wheezy)
lsb_release-r 7.8
lsb_release-c wheezy
etc_release
etc_issue Debian GNU/kFreeBSD 7 \n \l

Download Log Files

logs/timestamp.start.txt 76 Bytes curl -JLO 'http://pretest.housegordon.org/g/4907/logs/timestamp.start.txt'
logs/versions.txt 865 Bytes curl -JLO 'http://pretest.housegordon.org/g/4907/logs/versions.txt'
logs/environment.txt 138 Bytes curl -JLO 'http://pretest.housegordon.org/g/4907/logs/environment.txt'
logs/input.txt 210 Bytes curl -JLO 'http://pretest.housegordon.org/g/4907/logs/input.txt'
logs/configure.log 24.2 kB curl -JLO 'http://pretest.housegordon.org/g/4907/logs/configure.log'
logs/configure.ok 0 Bytes curl -JLO 'http://pretest.housegordon.org/g/4907/logs/configure.ok'
logs/make.log 15.5 kB curl -JLO 'http://pretest.housegordon.org/g/4907/logs/make.log'
logs/make.ok 0 Bytes curl -JLO 'http://pretest.housegordon.org/g/4907/logs/make.ok'
logs/make-check.log 36.3 kB curl -JLO 'http://pretest.housegordon.org/g/4907/logs/make-check.log'
logs/status 18 Bytes curl -JLO 'http://pretest.housegordon.org/g/4907/logs/status'
logs/config.log 423.0 kB curl -JLO 'http://pretest.housegordon.org/g/4907/logs/config.log'
logs/config.status 85.5 kB curl -JLO 'http://pretest.housegordon.org/g/4907/logs/config.status'
logs/config.h 23.1 kB curl -JLO 'http://pretest.housegordon.org/g/4907/logs/config.h'
logs/tail-error.log 3.2 kB curl -JLO 'http://pretest.housegordon.org/g/4907/logs/tail-error.log'