Pretest Build Reports - Build 4906 details

For more information see http://pretest.nongnu.org.

← back to list

Project: util-linux-2.30-rc2-22-3947
Source: http://files.housegordon.org/tmp/util-linux-2.30-rc2-22-3947.tar.xz
System: GNU 0.7 (i686-AT386)
Status:
make-check failed
Download logs (what's inside?) util-linux-2.30-rc2-22-3947.pretest-build-report.build-4906.tar.bz2
Last lines of tail-error.log:
make-check failed, tail of make-check.log:

schedutils: chrt-non-user                  ... SKIPPED (chrt not found)
schedutils: cpuset                         ... SKIPPED (test_cpuset not found)
script: buffering race                 ... SKIPPED (script not found)
script: options                        ... SKIPPED (test_script not found)
script: race conditions                ... SKIPPED (script not found)
script: replay                         ... SKIPPED (script not found)
sfdisk: MBR                            ... SKIPPED (no root permissions)
sfdisk: GPT                            ... SKIPPED (no root permissions)
sfdisk: movedata                       ... SKIPPED (no root permissions)
sfdisk: resize                         ... SKIPPED (no root permissions)
sfdisk: GPT                            ... SKIPPED (no root permissions)
sfdisk: wipe                           ... SKIPPED (no root permissions)
swapon: by devname                     ... SKIPPED (swapon not found)
swapon: fix page size                  ... SKIPPED (swapon not found)
swapon: fix signature                  ... SKIPPED (swapon not found)
swapon: by label                       ... SKIPPED (swapon not found)
swapon: by uuid                        ... SKIPPED (swapon not found)
utmp: last                           ...
: dns                         ... OK
: nodns                       ... OK
... OK (all 2 sub-tests PASSED)
utmp: last ipv6                      ...
: dns                         ... OK
: nodns                       ... OK
... OK (all 2 sub-tests PASSED)
utmp: circle                         ... OK
utmp: subsecond                      ... OK
utmp: to binary                      ... OK
utmp: IPv6 to binary                 ... OK
utmp: to text                        ... OK
utmp: IPv6 to text                   ... OK
uuid: uuid_parser                    ... OK
uuid: uuidd                          ... SKIPPED (uuidd not found)
uuid: uuidgen                        ... OK
wipefs: wipefs                         ... SKIPPED (no root permissions)

---------------------------------------------------------------------
3 tests of 192 FAILED
---------------------------------------------------------------------
Makefile:12354: recipe for target 'check-local-tests' failed
make[3]: *** [check-local-tests] Error 1
make[3]: Leaving directory '/tmp/util-linux-2.30-rc2-22-3947.yxiJPp/util-linux-2.30-rc2-22-3947'
Makefile:11995: recipe for target 'check-am' failed
make[2]: *** [check-am] Error 2
make[2]: Leaving directory '/tmp/util-linux-2.30-rc2-22-3947.yxiJPp/util-linux-2.30-rc2-22-3947'
Makefile:11706: recipe for target 'check-recursive' failed
make[1]: *** [check-recursive] Error 1
make[1]: Leaving directory '/tmp/util-linux-2.30-rc2-22-3947.yxiJPp/util-linux-2.30-rc2-22-3947'
Makefile:11999: recipe for target 'check' failed
make: *** [check] Error 2

Build information

PATH /usr/local/bin:/usr/bin:/bin:/usr/games
SHELL /bin/bash
PWD /tmp/util-linux-2.30-rc2-22-3947.yxiJPp
hostname hurd07
SOURCE http://files.housegordon.org/tmp/util-linux-2.30-rc2-22-3947.tar.xz
BASENAME util-linux-2.30-rc2-22-3947
configure_extra_params
make_extra_params
make_check_extra_params
env_extra_params
git_branch

Build host information

autoconf-version autoconf (GNU Autoconf) 2.69
automake-version automake (GNU automake) 1.15
autopoint-version /usr/bin/autopoint (GNU gettext-tools) 0.19.7
autoreconf-version autoreconf (GNU Autoconf) 2.69
make-version GNU Make 4.1
makeinfo-version missing
git-version git version 2.6.4
wget-version GNU Wget 1.17.1 built on gnu.
rsync-version rsync version 3.1.1 protocol version 31
gcc-version gcc (Debian 5.3.1-5) 5.3.1 20160101
cc-version cc (Debian 5.3.1-5) 5.3.1 20160101
uname-s GNU
uname-r 0.7
uname-m i686-AT386
uname-p unknown
uname-i unknown
uname-o GNU
uname-v GNU-Mach 1.6+git20160114-486/Hurd-0.7
lsb_release-v
lsb_release-i
lsb_release-d
lsb_release-r
lsb_release-c
etc_release
etc_issue Debian GNU/Hurd stretch/sid \n \l

Download Log Files

logs/timestamp.start.txt 76 Bytes curl -JLO 'http://pretest.housegordon.org/g/4906/logs/timestamp.start.txt'
logs/versions.txt 765 Bytes curl -JLO 'http://pretest.housegordon.org/g/4906/logs/versions.txt'
logs/environment.txt 121 Bytes curl -JLO 'http://pretest.housegordon.org/g/4906/logs/environment.txt'
logs/input.txt 210 Bytes curl -JLO 'http://pretest.housegordon.org/g/4906/logs/input.txt'
logs/configure.log 23.2 kB curl -JLO 'http://pretest.housegordon.org/g/4906/logs/configure.log'
logs/configure.ok 0 Bytes curl -JLO 'http://pretest.housegordon.org/g/4906/logs/configure.ok'
logs/make.log 18.6 kB curl -JLO 'http://pretest.housegordon.org/g/4906/logs/make.log'
logs/make.ok 0 Bytes curl -JLO 'http://pretest.housegordon.org/g/4906/logs/make.ok'
logs/make-check.log 36.9 kB curl -JLO 'http://pretest.housegordon.org/g/4906/logs/make-check.log'
logs/status 18 Bytes curl -JLO 'http://pretest.housegordon.org/g/4906/logs/status'
logs/config.log 408.6 kB curl -JLO 'http://pretest.housegordon.org/g/4906/logs/config.log'
logs/config.status 84.6 kB curl -JLO 'http://pretest.housegordon.org/g/4906/logs/config.status'
logs/config.h 23.2 kB curl -JLO 'http://pretest.housegordon.org/g/4906/logs/config.h'
logs/tail-error.log 3.2 kB curl -JLO 'http://pretest.housegordon.org/g/4906/logs/tail-error.log'