Pretest Build Reports - Build 4886 details

For more information see http://pretest.nongnu.org.

← back to list

Project: util-linux-2.30-rc2-16-2ac1b
Source: http://files.housegordon.org/tmp/util-linux-2.30-rc2-16-2ac1b.tar.xz
System: Linux 4.4.30-0-grsec (x86_64)
Status:
make failed
Download logs (what's inside?) util-linux-2.30-rc2-16-2ac1b.pretest-build-report.build-4886.tar.bz2
Last lines of tail-error.log:
make failed, tail of make.log:

CC       libmount/src/libmount_la-version.lo
CC       libmount/src/libmount_la-context.lo
CC       libmount/src/libmount_la-context_loopdev.lo
CC       libmount/src/libmount_la-context_mount.lo
CC       libmount/src/libmount_la-context_umount.lo
CC       libmount/src/libmount_la-monitor.lo
CCLD     libmount.la
CC       libsmartcols/src/libsmartcols_la-iter.lo
CC       libsmartcols/src/libsmartcols_la-symbols.lo
CC       libsmartcols/src/libsmartcols_la-cell.lo
CC       libsmartcols/src/libsmartcols_la-column.lo
CC       libsmartcols/src/libsmartcols_la-line.lo
CC       libsmartcols/src/libsmartcols_la-table.lo
CC       libsmartcols/src/libsmartcols_la-table_print.lo
CC       libsmartcols/src/libsmartcols_la-version.lo
CC       libsmartcols/src/libsmartcols_la-init.lo
CCLD     libsmartcols.la
CC       libfdisk/src/libfdisk_la-init.lo
CC       libfdisk/src/libfdisk_la-field.lo
CC       libfdisk/src/libfdisk_la-item.lo
CC       libfdisk/src/libfdisk_la-test.lo
CC       libfdisk/src/libfdisk_la-ask.lo
CC       libfdisk/src/libfdisk_la-alignment.lo
CC       libfdisk/src/libfdisk_la-label.lo
CC       libfdisk/src/libfdisk_la-utils.lo
CC       libfdisk/src/libfdisk_la-context.lo
CC       libfdisk/src/libfdisk_la-parttype.lo
CC       libfdisk/src/libfdisk_la-partition.lo
CC       libfdisk/src/libfdisk_la-table.lo
CC       libfdisk/src/libfdisk_la-iter.lo
CC       libfdisk/src/libfdisk_la-script.lo
CC       libfdisk/src/libfdisk_la-version.lo
CC       libfdisk/src/libfdisk_la-wipe.lo
CC       libfdisk/src/libfdisk_la-sun.lo
CC       libfdisk/src/libfdisk_la-sgi.lo
CC       libfdisk/src/libfdisk_la-dos.lo
CC       libfdisk/src/libfdisk_la-bsd.lo
CC       libfdisk/src/libfdisk_la-gpt.lo
CCLD     libfdisk.la
CC       sys-utils/dmesg-dmesg.o
sys-utils/dmesg.c:9:26: fatal error: linux/unistd.h: No such file or directory
compilation terminated.
Makefile:9274: recipe for target 'sys-utils/dmesg-dmesg.o' failed
make[2]: *** [sys-utils/dmesg-dmesg.o] Error 1
make[2]: Leaving directory '/tmp/util-linux-2.30-rc2-16-2ac1b.aMpOjK/util-linux-2.30-rc2-16-2ac1b'
Makefile:11706: recipe for target 'all-recursive' failed
make[1]: *** [all-recursive] Error 1
make[1]: Leaving directory '/tmp/util-linux-2.30-rc2-16-2ac1b.aMpOjK/util-linux-2.30-rc2-16-2ac1b'
Makefile:4900: recipe for target 'all' failed
make: *** [all] Error 2

Build information

PATH /bin:/usr/bin:/sbin:/usr/sbin
SHELL /bin/ash
PWD /tmp/util-linux-2.30-rc2-16-2ac1b.aMpOjK
hostname alp346
SOURCE http://files.housegordon.org/tmp/util-linux-2.30-rc2-16-2ac1b.tar.xz
BASENAME util-linux-2.30-rc2-16-2ac1b
configure_extra_params
make_extra_params
make_check_extra_params
env_extra_params
git_branch

Build host information

autoconf-version autoconf (GNU Autoconf) 2.69
automake-version automake (GNU automake) 1.15
autopoint-version /usr/bin/autopoint (GNU gettext-tools) 0.19.7
autoreconf-version autoreconf (GNU Autoconf) 2.69
make-version GNU Make 4.1
makeinfo-version texi2any (GNU texinfo) 6.1
git-version git version 2.8.3
wget-version GNU Wget 1.18 built on linux-musl.
rsync-version rsync version 3.1.2 protocol version 31
gcc-version gcc (Alpine 5.3.0) 5.3.0
cc-version cc (Alpine 5.3.0) 5.3.0
uname-s Linux
uname-r 4.4.30-0-grsec
uname-m x86_64
uname-p unknown
uname-i unknown
uname-o Linux
uname-v #1-Alpine SMP Mon Nov 7 20:19:21 GMT 2016
lsb_release-v
lsb_release-i
lsb_release-d
lsb_release-r
lsb_release-c
etc_release
etc_issue Welcome to Alpine Linux 3.4
etc_os_release_NAME Alpine Linux
etc_os_release_ID alpine
etc_os_release_VERSION_ID 3.4.6
etc_os_release_PRETTY_NAME Alpine Linux v3.4
etc_os_release_HOME_URL http://alpinelinux.org
etc_os_release_BUG_REPORT_URL http://bugs.alpinelinux.org

Download Log Files

logs/configure.log 21.5 kB curl -JLO 'http://pretest.housegordon.org/g/4886/logs/configure.log'
logs/config.h 23.1 kB curl -JLO 'http://pretest.housegordon.org/g/4886/logs/config.h'
logs/make.log 10.9 kB curl -JLO 'http://pretest.housegordon.org/g/4886/logs/make.log'
logs/status 12 Bytes curl -JLO 'http://pretest.housegordon.org/g/4886/logs/status'
logs/config.log 351.8 kB curl -JLO 'http://pretest.housegordon.org/g/4886/logs/config.log'
logs/input.txt 212 Bytes curl -JLO 'http://pretest.housegordon.org/g/4886/logs/input.txt'
logs/tail-error.log 2.4 kB curl -JLO 'http://pretest.housegordon.org/g/4886/logs/tail-error.log'
logs/versions.txt 1.0 kB curl -JLO 'http://pretest.housegordon.org/g/4886/logs/versions.txt'
logs/config.status 84.9 kB curl -JLO 'http://pretest.housegordon.org/g/4886/logs/config.status'
logs/configure.ok 0 Bytes curl -JLO 'http://pretest.housegordon.org/g/4886/logs/configure.ok'
logs/timestamp.start.txt 76 Bytes curl -JLO 'http://pretest.housegordon.org/g/4886/logs/timestamp.start.txt'
logs/environment.txt 111 Bytes curl -JLO 'http://pretest.housegordon.org/g/4886/logs/environment.txt'