Pretest Build Reports - Build 4882 details

For more information see http://pretest.nongnu.org.

← back to list

Project: util-linux-2.30-rc2-16-2ac1b
Source: http://files.housegordon.org/tmp/util-linux-2.30-rc2-16-2ac1b.tar.xz
System: OpenBSD 5.7 (amd64)
Status:
make failed
Download logs (what's inside?) util-linux-2.30-rc2-16-2ac1b.pretest-build-report.build-4882.tar.bz2
Last lines of tail-error.log:
make failed, tail of make.log:

CC       lib/libcommon_la-match.lo
CC       lib/libcommon_la-mbsalign.lo
In file included from ./include/c.h:12,
from lib/mbsalign.c:28:
/usr/include/unistd.h:368: warning: redundant redeclaration of 'lseek'
/usr/include/sys/types.h:216: warning: previous declaration of 'lseek' was here
/usr/include/unistd.h:404: warning: redundant redeclaration of 'ftruncate'
/usr/include/sys/types.h:217: warning: previous declaration of 'ftruncate' was here
/usr/include/unistd.h:422: warning: redundant redeclaration of 'mkstemp'
/usr/include/stdlib.h:215: warning: previous declaration of 'mkstemp' was here
/usr/include/unistd.h:423: warning: redundant redeclaration of 'mktemp'
/usr/include/stdlib.h:184: warning: previous declaration of 'mktemp' was here
/usr/include/unistd.h:429: warning: redundant redeclaration of 'truncate'
/usr/include/sys/types.h:218: warning: previous declaration of 'truncate' was here
/usr/include/unistd.h:507: warning: redundant redeclaration of 'mkdtemp'
/usr/include/stdlib.h:255: warning: previous declaration of 'mkdtemp' was here
/usr/include/unistd.h:508: warning: redundant redeclaration of 'mkstemps'
/usr/include/stdlib.h:295: warning: previous declaration of 'mkstemps' was here
CC       lib/libcommon_la-mbsedit.lo
CC       lib/libcommon_la-md5.lo
CC       lib/libcommon_la-pager.lo
In file included from lib/pager.c:8:
/usr/include/unistd.h:368: warning: redundant redeclaration of 'lseek'
/usr/include/sys/types.h:216: warning: previous declaration of 'lseek' was here
/usr/include/unistd.h:404: warning: redundant redeclaration of 'ftruncate'
/usr/include/sys/types.h:217: warning: previous declaration of 'ftruncate' was here
/usr/include/unistd.h:429: warning: redundant redeclaration of 'truncate'
/usr/include/sys/types.h:218: warning: previous declaration of 'truncate' was here
In file included from lib/pager.c:9:
/usr/include/stdlib.h:184: warning: redundant redeclaration of 'mktemp'
/usr/include/unistd.h:423: warning: previous declaration of 'mktemp' was here
/usr/include/stdlib.h:215: warning: redundant redeclaration of 'mkstemp'
/usr/include/unistd.h:422: warning: previous declaration of 'mkstemp' was here
/usr/include/stdlib.h:255: warning: redundant redeclaration of 'mkdtemp'
/usr/include/unistd.h:507: warning: previous declaration of 'mkdtemp' was here
/usr/include/stdlib.h:295: warning: redundant redeclaration of 'mkstemps'
/usr/include/unistd.h:508: warning: previous declaration of 'mkstemps' was here
In file included from ./include/c.h:16,
from lib/pager.c:17:
/usr/include/errno.h:54: warning: redundant redeclaration of '__errno'
/usr/include/signal.h:72: warning: previous declaration of '__errno' was here
In file included from lib/pager.c:20:
./include/ttyutils.h: In function 'reset_virtual_console':
./include/ttyutils.h:119: error: 'TAB0' undeclared (first use in this function)
./include/ttyutils.h:119: error: (Each undeclared identifier is reported only once
./include/ttyutils.h:119: error: for each function it appears in.)
./include/ttyutils.h:120: error: 'TABDLY' undeclared (first use in this function)
*** Error 1 in . (Makefile:8399 'lib/libcommon_la-pager.lo': @echo "  CC      " lib/libcommon_la-pager.lo;/bin/sh ./libtool --silent --tag=C...)
*** Error 1 in . (Makefile:11731 'all-recursive')
*** Error 1 in /tmp/util-linux-2.30-rc2-16-2ac1b.Lyejcy/util-linux-2.30-rc2-16-2ac1b (Makefile:4900 'all')

Build information

PATH /usr/bin:/bin:/usr/sbin:/sbin:/usr/X11R6/bin:/usr/local/bin:/usr/local/sbin
SHELL /bin/ksh
PWD /tmp/util-linux-2.30-rc2-16-2ac1b.Lyejcy
hostname obsd57.my.domain
SOURCE http://files.housegordon.org/tmp/util-linux-2.30-rc2-16-2ac1b.tar.xz
BASENAME util-linux-2.30-rc2-16-2ac1b
configure_extra_params
make_extra_params
make_check_extra_params
env_extra_params
git_branch

Build host information

autoconf-version no-version
automake-version no-version
autopoint-version /usr/local/bin/autopoint (GNU gettext-tools) 0.19.4
autoreconf-version no-version
make-version no-version
makeinfo-version makeinfo (GNU texinfo) 4.8
git-version git version 2.3.0
wget-version GNU Wget 1.16.1 built on openbsd5.7.
rsync-version rsync version 3.1.1 protocol version 31
gcc-version gcc (GCC) 4.2.1 20070719
cc-version cc (GCC) 4.2.1 20070719
uname-s OpenBSD
uname-r 5.7
uname-m amd64
uname-p amd64
uname-i
uname-o
uname-v GENERIC#825
lsb_release-v
lsb_release-i
lsb_release-d
lsb_release-r
lsb_release-c
etc_release
etc_issue

Download Log Files

logs/timestamp.start.txt 76 Bytes curl -JLO 'http://pretest.housegordon.org/g/4882/logs/timestamp.start.txt'
logs/versions.txt 647 Bytes curl -JLO 'http://pretest.housegordon.org/g/4882/logs/versions.txt'
logs/environment.txt 167 Bytes curl -JLO 'http://pretest.housegordon.org/g/4882/logs/environment.txt'
logs/input.txt 212 Bytes curl -JLO 'http://pretest.housegordon.org/g/4882/logs/input.txt'
logs/configure.log 24.6 kB curl -JLO 'http://pretest.housegordon.org/g/4882/logs/configure.log'
logs/configure.ok 0 Bytes curl -JLO 'http://pretest.housegordon.org/g/4882/logs/configure.ok'
logs/make.log 13.2 kB curl -JLO 'http://pretest.housegordon.org/g/4882/logs/make.log'
logs/status 12 Bytes curl -JLO 'http://pretest.housegordon.org/g/4882/logs/status'
logs/config.log 452.7 kB curl -JLO 'http://pretest.housegordon.org/g/4882/logs/config.log'
logs/config.status 83.7 kB curl -JLO 'http://pretest.housegordon.org/g/4882/logs/config.status'
logs/config.h 23.2 kB curl -JLO 'http://pretest.housegordon.org/g/4882/logs/config.h'
logs/tail-error.log 3.5 kB curl -JLO 'http://pretest.housegordon.org/g/4882/logs/tail-error.log'