Pretest Build Reports - Build 4881 details

For more information see http://pretest.nongnu.org.

← back to list

Project: util-linux-2.30-rc2-16-2ac1b
Source: http://files.housegordon.org/tmp/util-linux-2.30-rc2-16-2ac1b.tar.xz
System: gNewSense 3.0 (x86_64)
Status:
make failed
Download logs (what's inside?) util-linux-2.30-rc2-16-2ac1b.pretest-build-report.build-4881.tar.bz2
Last lines of tail-error.log:
make failed, tail of make.log:

CC       libmount/src/libmount_la-test.lo
CC       libmount/src/libmount_la-utils.lo
CC       libmount/src/libmount_la-version.lo
CC       libmount/src/libmount_la-context.lo
CC       libmount/src/libmount_la-context_loopdev.lo
CC       libmount/src/libmount_la-context_mount.lo
CC       libmount/src/libmount_la-context_umount.lo
CC       libmount/src/libmount_la-monitor.lo
CCLD     libmount.la
CC       libsmartcols/src/libsmartcols_la-iter.lo
CC       libsmartcols/src/libsmartcols_la-symbols.lo
CC       libsmartcols/src/libsmartcols_la-cell.lo
CC       libsmartcols/src/libsmartcols_la-column.lo
CC       libsmartcols/src/libsmartcols_la-line.lo
CC       libsmartcols/src/libsmartcols_la-table.lo
CC       libsmartcols/src/libsmartcols_la-table_print.lo
CC       libsmartcols/src/libsmartcols_la-version.lo
CC       libsmartcols/src/libsmartcols_la-init.lo
CCLD     libsmartcols.la
CC       libfdisk/src/libfdisk_la-init.lo
CC       libfdisk/src/libfdisk_la-field.lo
CC       libfdisk/src/libfdisk_la-item.lo
CC       libfdisk/src/libfdisk_la-test.lo
CC       libfdisk/src/libfdisk_la-ask.lo
CC       libfdisk/src/libfdisk_la-alignment.lo
CC       libfdisk/src/libfdisk_la-label.lo
CC       libfdisk/src/libfdisk_la-utils.lo
CC       libfdisk/src/libfdisk_la-context.lo
CC       libfdisk/src/libfdisk_la-parttype.lo
CC       libfdisk/src/libfdisk_la-partition.lo
CC       libfdisk/src/libfdisk_la-table.lo
CC       libfdisk/src/libfdisk_la-iter.lo
CC       libfdisk/src/libfdisk_la-script.lo
CC       libfdisk/src/libfdisk_la-version.lo
CC       libfdisk/src/libfdisk_la-wipe.lo
CC       libfdisk/src/libfdisk_la-sun.lo
CC       libfdisk/src/libfdisk_la-sgi.lo
CC       libfdisk/src/libfdisk_la-dos.lo
CC       libfdisk/src/libfdisk_la-bsd.lo
CC       libfdisk/src/libfdisk_la-gpt.lo
CCLD     libfdisk.la
CC       text-utils/more-more.o
CCLD     more
/usr/bin/ld: cannot find -lncursesw
collect2: ld returned 1 exit status
make[2]: *** [more] Error 1
make[2]: Leaving directory `/tmp/util-linux-2.30-rc2-16-2ac1b.lVClTz/util-linux-2.30-rc2-16-2ac1b'
make[1]: *** [all-recursive] Error 1
make[1]: Leaving directory `/tmp/util-linux-2.30-rc2-16-2ac1b.lVClTz/util-linux-2.30-rc2-16-2ac1b'
make: *** [all] Error 2

Build information

PATH /usr/local/bin:/usr/bin:/bin:/usr/bin/X11:/usr/games
SHELL /bin/bash
PWD /tmp/util-linux-2.30-rc2-16-2ac1b.lVClTz
hostname gnewsense31
SOURCE http://files.housegordon.org/tmp/util-linux-2.30-rc2-16-2ac1b.tar.xz
BASENAME util-linux-2.30-rc2-16-2ac1b
configure_extra_params
make_extra_params
make_check_extra_params
env_extra_params
git_branch

Build host information

autoconf-version autoconf (GNU Autoconf) 2.67
automake-version automake (GNU automake) 1.11.1
autopoint-version /usr/bin/autopoint (GNU gettext-tools) 0.18.1
autoreconf-version autoreconf (GNU Autoconf) 2.67
make-version GNU Make 3.81
makeinfo-version makeinfo (GNU texinfo) 4.13
git-version git version 1.7.2.5
wget-version GNU Wget 1.12 built on linux-gnu.
rsync-version rsync version 3.0.7 protocol version 30
gcc-version gcc (Debian 4.4.5-8) 4.4.5
cc-version cc (Debian 4.4.5-8) 4.4.5
uname-s Linux
uname-r 2.6.32-5gnewsense1-amd64
uname-m x86_64
uname-p unknown
uname-i unknown
uname-o GNU/Linux
uname-v #1 SMP Sun Oct 6 10:04:36 UTC 2013
lsb_release-v
lsb_release-i gNewSense
lsb_release-d gNewSense GNU/Linux 3.0 (parkes)
lsb_release-r 3.0
lsb_release-c parkes
etc_release
etc_issue gNewSense GNU/Linux 3.0 \n \l

Download Log Files

logs/config.h 23.1 kB curl -JLO 'http://pretest.housegordon.org/g/4881/logs/config.h'
logs/config.log 380.1 kB curl -JLO 'http://pretest.housegordon.org/g/4881/logs/config.log'
logs/configure.log 21.7 kB curl -JLO 'http://pretest.housegordon.org/g/4881/logs/configure.log'
logs/timestamp.start.txt 76 Bytes curl -JLO 'http://pretest.housegordon.org/g/4881/logs/timestamp.start.txt'
logs/tail-error.log 2.3 kB curl -JLO 'http://pretest.housegordon.org/g/4881/logs/tail-error.log'
logs/versions.txt 849 Bytes curl -JLO 'http://pretest.housegordon.org/g/4881/logs/versions.txt'
logs/configure.ok 0 Bytes curl -JLO 'http://pretest.housegordon.org/g/4881/logs/configure.ok'
logs/input.txt 212 Bytes curl -JLO 'http://pretest.housegordon.org/g/4881/logs/input.txt'
logs/environment.txt 140 Bytes curl -JLO 'http://pretest.housegordon.org/g/4881/logs/environment.txt'
logs/config.status 85.7 kB curl -JLO 'http://pretest.housegordon.org/g/4881/logs/config.status'
logs/status 12 Bytes curl -JLO 'http://pretest.housegordon.org/g/4881/logs/status'
logs/make.log 10.0 kB curl -JLO 'http://pretest.housegordon.org/g/4881/logs/make.log'