Pretest Build Reports - Build 4848 details

For more information see http://pretest.nongnu.org.

← back to list

Project: util-linux-2.30-rc2-16-2ac1b
Source: http://files.housegordon.org/tmp/util-linux-2.30-rc2-16-2ac1b.tar.xz
System: Fedora 20 (ppc64)
Status:
make-check failed
Download logs (what's inside?) util-linux-2.30-rc2-16-2ac1b.pretest-build-report.build-4848.tar.bz2
Last lines of tail-error.log:
make-check failed, tail of make-check.log:

blkid: superblocks probing: [38] ocfs2               ... OK
blkid: superblocks probing: [39] promise-raid        ... OK
libfdisk: GPT: [04] setattr                             ... OK
libfdisk: GPT                                           ... OK (all 4 sub-tests PASSED)
blkid: superblocks probing: [40] reiser3             ... OK
blkid: superblocks probing: [41] reiser4             ... OK
blkid: superblocks probing: [42] romfs               ... OK
blkid: superblocks probing: [43] silicon-raid        ... OK
blkid: superblocks probing: [44] small-fat32         ... OK
blkid: superblocks probing: [45] swap0               ... OK
blkid: superblocks probing: [46] swap1               ... OK
blkid: superblocks probing: [47] tuxonice            ... OK
blkid: superblocks probing: [48] ubifs               ... OK
blkid: superblocks probing: [49] udf-cd-nero-6       ... OK
blkid: superblocks probing: [50] udf-hdd-mkudffs-1.0.0-1 ... OK
blkid: superblocks probing: [51] udf-hdd-mkudffs-1.0.0-2 ... OK
blkid: superblocks probing: [52] udf-hdd-mkudffs-1.3-1 ... OK
blkid: superblocks probing: [53] udf-hdd-mkudffs-1.3-2 ... OK
blkid: superblocks probing: [54] udf-hdd-mkudffs-1.3-3 ... OK
blkid: superblocks probing: [55] udf-hdd-udfclient-0.7.5 ... OK
blkid: superblocks probing: [56] udf-hdd-udfclient-0.7.7 ... OK
blkid: superblocks probing: [57] udf-hdd-win7        ... OK
blkid: superblocks probing: [58] udf                 ... OK
blkid: superblocks probing: [59] ufs                 ... OK
blkid: superblocks probing: [60] via-raid            ... OK
blkid: superblocks probing: [61] vmfs                ... OK
blkid: superblocks probing: [62] vmfs_volume         ... OK
blkid: superblocks probing: [63] xfs-log             ... OK
blkid: superblocks probing: [64] xfs                 ... OK
blkid: superblocks probing: [65] zfs                 ... OK
blkid: superblocks probing                           ... OK (all 65 sub-tests PASSED)
fdisk: MBR - sort                                    ... OK
fdisk: sunlabel tests                                ... OK
fdisk: nested BSD                                    ... OK
fdisk: MBR - dos mode                                ... OK
fdisk: MBR - non-dos mode                            ... OK
fdisk: GPT                                           ... OK
minix: mkfs fsck                                     ... OK
script: race conditions                               ... OK

---------------------------------------------------------------------
1 tests of 192 FAILED
---------------------------------------------------------------------
make[3]: *** [check-local-tests] Error 1
make[3]: Leaving directory `/home/agn/pretest.2017-05-30.sRCw53/util-linux-2.30-rc2-16-2ac1b.5gDT1c/util-linux-2.30-rc2-16-2ac1b'
make[2]: *** [check-am] Error 2
make[2]: Leaving directory `/home/agn/pretest.2017-05-30.sRCw53/util-linux-2.30-rc2-16-2ac1b.5gDT1c/util-linux-2.30-rc2-16-2ac1b'
make[1]: *** [check-recursive] Error 1
make[1]: Leaving directory `/home/agn/pretest.2017-05-30.sRCw53/util-linux-2.30-rc2-16-2ac1b.5gDT1c/util-linux-2.30-rc2-16-2ac1b'
make: *** [check] Error 2

Build information

PATH /usr/lib64/qt-3.3/bin:/usr/local/bin:/usr/bin
SHELL /bin/bash
PWD /home/agn/pretest.2017-05-30.sRCw53/util-linux-2.30-rc2-16-2ac1b.5gDT1c
hostname gcc1-power7.osuosl.org
SOURCE http://files.housegordon.org/tmp/util-linux-2.30-rc2-16-2ac1b.tar.xz
BASENAME util-linux-2.30-rc2-16-2ac1b
configure_extra_params
make_extra_params
make_check_extra_params
env_extra_params
git_branch

Build host information

autoconf-version autoconf (GNU Autoconf) 2.69
automake-version automake (GNU automake) 1.13.4
autopoint-version /usr/bin/autopoint (GNU gettext-tools) 0.18.3
autoreconf-version autoreconf (GNU Autoconf) 2.69
make-version GNU Make 3.82
makeinfo-version makeinfo (GNU texinfo) 5.1
git-version git version 1.9.3
wget-version GNU Wget 1.14 built on linux-gnu.
rsync-version rsync version 3.1.0 protocol version 31
gcc-version gcc (GCC) 4.8.3 20140911 (Red Hat 4.8.3-7)
cc-version cc (GCC) 4.8.3 20140911 (Red Hat 4.8.3-7)
uname-s Linux
uname-r 3.17.2-200.fc20.ppc64p7
uname-m ppc64
uname-p ppc64
uname-i ppc64
uname-o GNU/Linux
uname-v #1 SMP Wed Feb 18 20:59:33 MST 2015
lsb_release-v :core-4.1-noarch:core-4.1-ppc64:cxx-4.1-noarch:cxx-4.1-ppc64:desktop-4.1-noarch:desktop-4.1-ppc64:languages-4.1-noarch:languages-4.1-ppc64:printing-4.1-noarch:printing-4.1-ppc64
lsb_release-i Fedora
lsb_release-d "Fedora release 20 (Heisenbug)"
lsb_release-r 20
lsb_release-c Heisenbug
etc_release
etc_issue Fedora release 20 (Heisenbug)

Download Log Files

logs/configure.ok 0 Bytes curl -JLO 'http://pretest.housegordon.org/g/4848/logs/configure.ok'
logs/environment.txt 175 Bytes curl -JLO 'http://pretest.housegordon.org/g/4848/logs/environment.txt'
logs/config.status 86.6 kB curl -JLO 'http://pretest.housegordon.org/g/4848/logs/config.status'
logs/config.log 296.0 kB curl -JLO 'http://pretest.housegordon.org/g/4848/logs/config.log'
logs/make.log 17.1 kB curl -JLO 'http://pretest.housegordon.org/g/4848/logs/make.log'
logs/config.h 23.0 kB curl -JLO 'http://pretest.housegordon.org/g/4848/logs/config.h'
logs/tail-error.log 3.5 kB curl -JLO 'http://pretest.housegordon.org/g/4848/logs/tail-error.log'
logs/configure.log 21.2 kB curl -JLO 'http://pretest.housegordon.org/g/4848/logs/configure.log'
logs/input.txt 212 Bytes curl -JLO 'http://pretest.housegordon.org/g/4848/logs/input.txt'
logs/make.ok 0 Bytes curl -JLO 'http://pretest.housegordon.org/g/4848/logs/make.ok'
logs/make-check.log 46.1 kB curl -JLO 'http://pretest.housegordon.org/g/4848/logs/make-check.log'
logs/versions.txt 1.0 kB curl -JLO 'http://pretest.housegordon.org/g/4848/logs/versions.txt'
logs/status 18 Bytes curl -JLO 'http://pretest.housegordon.org/g/4848/logs/status'
logs/timestamp.start.txt 76 Bytes curl -JLO 'http://pretest.housegordon.org/g/4848/logs/timestamp.start.txt'