Pretest Build Reports - Build 4845 details

For more information see http://pretest.nongnu.org.

← back to list

Project: util-linux-2.30-rc2
Source: http://www.kernel.org/pub/linux/utils/util-linux/v2.30/util-linux-2.30-rc2.tar.gz
System: Linux 4.9.24-0-virtgrsec (x86_64)
Status:
make-check failed
Download logs (what's inside?) util-linux-2.30-rc2.pretest-build-report.build-4845.tar.bz2
Last lines of tail-error.log:
make-check failed, tail of make-check.log:

CC       libsmartcols/samples/sample_scols_continuous-continuous.o
CCLD     sample-scols-continuous
CC       libsmartcols/samples/sample_scols_fromfile-fromfile.o
CCLD     sample-scols-fromfile
CC       libsmartcols/samples/sample_scols_maxout-maxout.o
CCLD     sample-scols-maxout
CC       libsmartcols/samples/sample_scols_tree-tree.o
CCLD     sample-scols-tree
CC       libfdisk/src/test_fdisk_ask-ask.o
CCLD     test_fdisk_ask
CC       libfdisk/src/test_fdisk_gpt-gpt.o
CCLD     test_fdisk_gpt
CC       libfdisk/src/test_fdisk_script-script.o
CCLD     test_fdisk_script
CC       libfdisk/src/test_fdisk_utils-utils.o
CCLD     test_fdisk_utils
CC       libfdisk/src/test_fdisk_version-version.o
CCLD     test_fdisk_version
CC       libfdisk/src/test_fdisk_item-item.o
CCLD     test_fdisk_item
CC       libfdisk/samples/sample_fdisk_mkpart-mkpart.o
CCLD     sample-fdisk-mkpart
CC       term-utils/test_script-script.o
CC       lib/test_script-monotonic.o
CCLD     test_script
CC       login-utils/test_consoles-sulogin-consoles.o
CCLD     test_consoles
CC       login-utils/test_islocal-islocal.o
CCLD     test_islocal
CC       login-utils/test_logindefs-logindefs.o
CCLD     test_logindefs
CC       sys-utils/test_dmesg-dmesg.o
CC       lib/test_dmesg-monotonic.o
CCLD     test_dmesg
CC       misc-utils/test_logger-logger.o
CC       lib/test_logger-strutils.o
CC       lib/test_logger-strv.o
CCLD     test_logger
CC       misc-utils/test_uuidd-test_uuidd.o
misc-utils/test_uuidd.c:26:19: fatal error: error.h: No such file or directory
#include <error.h>
^
compilation terminated.
make[3]: *** [Makefile:11056: misc-utils/test_uuidd-test_uuidd.o] Error 1
make[3]: Leaving directory '/tmp/util-linux-2.30-rc2.jpFaKn/util-linux-2.30-rc2'
make[2]: *** [Makefile:11985: check-am] Error 2
make[2]: Leaving directory '/tmp/util-linux-2.30-rc2.jpFaKn/util-linux-2.30-rc2'
make[1]: *** [Makefile:11696: check-recursive] Error 1
make[1]: Leaving directory '/tmp/util-linux-2.30-rc2.jpFaKn/util-linux-2.30-rc2'
make: *** [Makefile:11989: check] Error 2

Build information

PATH /usr/local/sbin:/usr/local/bin:/usr/sbin:/usr/bin:/sbin:/bin
SHELL /bin/ash
PWD /tmp/util-linux-2.30-rc2.jpFaKn
hostname alp352
SOURCE http://www.kernel.org/pub/linux/utils/util-linux/v2.30/util-linux-2.30-rc2.tar.gz
BASENAME util-linux-2.30-rc2
configure_extra_params
make_extra_params
make_check_extra_params
env_extra_params
git_branch

Build host information

autoconf-version autoconf (GNU Autoconf) 2.69
automake-version automake (GNU automake) 1.15
autopoint-version /usr/bin/autopoint (GNU gettext-tools) 0.19.8.1
autoreconf-version autoreconf (GNU Autoconf) 2.69
make-version GNU Make 4.2.1
makeinfo-version texi2any (GNU texinfo) 6.3
git-version git version 2.11.1
wget-version GNU Wget 1.18 built on linux-musl.
rsync-version rsync version 3.1.2 protocol version 31
gcc-version gcc (Alpine 6.2.1) 6.2.1 20160822
cc-version cc (Alpine 6.2.1) 6.2.1 20160822
uname-s Linux
uname-r 4.9.24-0-virtgrsec
uname-m x86_64
uname-p unknown
uname-i unknown
uname-o Linux
uname-v #1-Alpine SMP Tue Apr 25 08:46:50 GMT 2017
lsb_release-v
lsb_release-i
lsb_release-d
lsb_release-r
lsb_release-c
etc_release
etc_issue Welcome to Alpine Linux 3.5
etc_os_release_NAME Alpine Linux
etc_os_release_ID alpine
etc_os_release_VERSION_ID 3.5.2
etc_os_release_PRETTY_NAME Alpine Linux v3.5
etc_os_release_HOME_URL http://alpinelinux.org
etc_os_release_BUG_REPORT_URL http://bugs.alpinelinux.org

Download Log Files

logs/make-check.log 7.1 kB curl -JLO 'http://pretest.housegordon.org/g/4845/logs/make-check.log'
logs/make.log 18.1 kB curl -JLO 'http://pretest.housegordon.org/g/4845/logs/make.log'
logs/timestamp.start.txt 76 Bytes curl -JLO 'http://pretest.housegordon.org/g/4845/logs/timestamp.start.txt'
logs/config.log 341.5 kB curl -JLO 'http://pretest.housegordon.org/g/4845/logs/config.log'
logs/configure.ok 0 Bytes curl -JLO 'http://pretest.housegordon.org/g/4845/logs/configure.ok'
logs/config.status 81.4 kB curl -JLO 'http://pretest.housegordon.org/g/4845/logs/config.status'
logs/make.ok 0 Bytes curl -JLO 'http://pretest.housegordon.org/g/4845/logs/make.ok'
logs/configure.log 21.3 kB curl -JLO 'http://pretest.housegordon.org/g/4845/logs/configure.log'
logs/environment.txt 133 Bytes curl -JLO 'http://pretest.housegordon.org/g/4845/logs/environment.txt'
logs/status 18 Bytes curl -JLO 'http://pretest.housegordon.org/g/4845/logs/status'
logs/versions.txt 1.1 kB curl -JLO 'http://pretest.housegordon.org/g/4845/logs/versions.txt'
logs/tail-error.log 2.2 kB curl -JLO 'http://pretest.housegordon.org/g/4845/logs/tail-error.log'
logs/config.h 22.8 kB curl -JLO 'http://pretest.housegordon.org/g/4845/logs/config.h'
logs/input.txt 216 Bytes curl -JLO 'http://pretest.housegordon.org/g/4845/logs/input.txt'