Pretest Build Reports - Build 4844 details

For more information see http://pretest.nongnu.org.

← back to list

Project: util-linux-2.30-rc2
Source: http://www.kernel.org/pub/linux/utils/util-linux/v2.30/util-linux-2.30-rc2.tar.gz
System: Linux 4.9.24-0-virtgrsec (x86_64)
Status:
make failed
Download logs (what's inside?) util-linux-2.30-rc2.pretest-build-report.build-4844.tar.bz2
Last lines of tail-error.log:
make failed, tail of make.log:

make  all-recursive
make[1]: Entering directory '/tmp/util-linux-2.30-rc2.fajJCb/util-linux-2.30-rc2'
Making all in po
make[2]: Entering directory '/tmp/util-linux-2.30-rc2.fajJCb/util-linux-2.30-rc2/po'
make[2]: Nothing to be done for 'all'.
make[2]: Leaving directory '/tmp/util-linux-2.30-rc2.fajJCb/util-linux-2.30-rc2/po'
make[2]: Entering directory '/tmp/util-linux-2.30-rc2.fajJCb/util-linux-2.30-rc2'
CC       lib/libcommon_la-blkdev.lo
CC       lib/libcommon_la-canonicalize.lo
CC       lib/libcommon_la-crc32.lo
CC       lib/libcommon_la-env.lo
CC       lib/libcommon_la-idcache.lo
CC       lib/libcommon_la-fileutils.lo
CC       lib/libcommon_la-ismounted.lo
CC       lib/libcommon_la-color-names.lo
CC       lib/libcommon_la-mangle.lo
CC       lib/libcommon_la-match.lo
CC       lib/libcommon_la-mbsalign.lo
CC       lib/libcommon_la-mbsedit.lo
CC       lib/libcommon_la-md5.lo
CC       lib/libcommon_la-pager.lo
CC       lib/libcommon_la-parse-date.lo
CC       lib/libcommon_la-path.lo
CC       lib/libcommon_la-randutils.lo
CC       lib/libcommon_la-setproctitle.lo
CC       lib/libcommon_la-strutils.lo
CC       lib/libcommon_la-timeutils.lo
CC       lib/libcommon_la-ttyutils.lo
CC       lib/libcommon_la-exec_shell.lo
CC       lib/libcommon_la-strv.lo
CC       lib/libcommon_la-linux_version.lo
CC       lib/libcommon_la-loopdev.lo
lib/loopdev.c:35:31: fatal error: linux/posix_types.h: No such file or directory
#include <linux/posix_types.h>
^
compilation terminated.
make[2]: *** [Makefile:8466: lib/libcommon_la-loopdev.lo] Error 1
make[2]: Leaving directory '/tmp/util-linux-2.30-rc2.fajJCb/util-linux-2.30-rc2'
make[1]: *** [Makefile:11696: all-recursive] Error 1
make[1]: Leaving directory '/tmp/util-linux-2.30-rc2.fajJCb/util-linux-2.30-rc2'
make: *** [Makefile:4891: all] Error 2

Build information

PATH /bin:/usr/bin:/sbin:/usr/sbin
SHELL /bin/ash
PWD /tmp/util-linux-2.30-rc2.fajJCb
hostname alp352
SOURCE http://www.kernel.org/pub/linux/utils/util-linux/v2.30/util-linux-2.30-rc2.tar.gz
BASENAME util-linux-2.30-rc2
configure_extra_params
make_extra_params
make_check_extra_params SUBDIRS=.
env_extra_params
git_branch

Build host information

autoconf-version autoconf (GNU Autoconf) 2.69
automake-version automake (GNU automake) 1.15
autopoint-version /usr/bin/autopoint (GNU gettext-tools) 0.19.8.1
autoreconf-version autoreconf (GNU Autoconf) 2.69
make-version GNU Make 4.2.1
makeinfo-version texi2any (GNU texinfo) 6.3
git-version git version 2.11.1
wget-version GNU Wget 1.18 built on linux-musl.
rsync-version rsync version 3.1.2 protocol version 31
gcc-version gcc (Alpine 6.2.1) 6.2.1 20160822
cc-version cc (Alpine 6.2.1) 6.2.1 20160822
uname-s Linux
uname-r 4.9.24-0-virtgrsec
uname-m x86_64
uname-p unknown
uname-i unknown
uname-o Linux
uname-v #1-Alpine SMP Tue Apr 25 08:46:50 GMT 2017
lsb_release-v
lsb_release-i
lsb_release-d
lsb_release-r
lsb_release-c
etc_release
etc_issue Welcome to Alpine Linux 3.5
etc_os_release_NAME Alpine Linux
etc_os_release_ID alpine
etc_os_release_VERSION_ID 3.5.2
etc_os_release_PRETTY_NAME Alpine Linux v3.5
etc_os_release_HOME_URL http://alpinelinux.org
etc_os_release_BUG_REPORT_URL http://bugs.alpinelinux.org

Download Log Files

logs/make.log 1.9 kB curl -JLO 'http://pretest.housegordon.org/g/4844/logs/make.log'
logs/timestamp.start.txt 76 Bytes curl -JLO 'http://pretest.housegordon.org/g/4844/logs/timestamp.start.txt'
logs/config.log 352.2 kB curl -JLO 'http://pretest.housegordon.org/g/4844/logs/config.log'
logs/configure.ok 0 Bytes curl -JLO 'http://pretest.housegordon.org/g/4844/logs/configure.ok'
logs/config.status 81.1 kB curl -JLO 'http://pretest.housegordon.org/g/4844/logs/config.status'
logs/configure.log 21.5 kB curl -JLO 'http://pretest.housegordon.org/g/4844/logs/configure.log'
logs/environment.txt 102 Bytes curl -JLO 'http://pretest.housegordon.org/g/4844/logs/environment.txt'
logs/status 12 Bytes curl -JLO 'http://pretest.housegordon.org/g/4844/logs/status'
logs/versions.txt 1.1 kB curl -JLO 'http://pretest.housegordon.org/g/4844/logs/versions.txt'
logs/tail-error.log 1.9 kB curl -JLO 'http://pretest.housegordon.org/g/4844/logs/tail-error.log'
logs/config.h 22.8 kB curl -JLO 'http://pretest.housegordon.org/g/4844/logs/config.h'
logs/input.txt 226 Bytes curl -JLO 'http://pretest.housegordon.org/g/4844/logs/input.txt'