Pretest Build Reports - Build 4841 details

For more information see http://pretest.nongnu.org.

← back to list

Project: util-linux-2.30-rc2
Source: http://www.kernel.org/pub/linux/utils/util-linux/v2.30/util-linux-2.30-rc2.tar.gz
System: Fedora 24 (x86_64)
Status:
make-check failed
Download logs (what's inside?) util-linux-2.30-rc2.pretest-build-report.build-4841.tar.bz2
Last lines of tail-error.log:
make-check failed, tail of make-check.log:

: force                       ... OK
: quiet                       ... OK
: return                      ... OK
... OK (all 4 sub-tests PASSED)
script: race conditions                ... OK
script: replay                         ... OK
sfdisk: MBR                            ... SKIPPED (no root permissions)
sfdisk: GPT                            ... SKIPPED (no root permissions)
sfdisk: movedata                       ... SKIPPED (no root permissions)
sfdisk: resize                         ... SKIPPED (no root permissions)
sfdisk: GPT                            ... SKIPPED (no root permissions)
sfdisk: wipe                           ... SKIPPED (no root permissions)
swapon: by devname                     ... SKIPPED (no root permissions)
swapon: fix page size                  ... SKIPPED (no root permissions)
swapon: fix signature                  ... SKIPPED (no root permissions)
swapon: by label                       ... SKIPPED (no root permissions)
swapon: by uuid                        ... SKIPPED (no root permissions)
utmp: last                           ...
: dns                         ... OK
: nodns                       ... OK
... OK (all 2 sub-tests PASSED)
utmp: last ipv6                      ...
: dns                         ... OK
: nodns                       ... OK
... OK (all 2 sub-tests PASSED)
utmp: circle                         ... OK
utmp: subsecond                      ... OK
utmp: to binary                      ... OK
utmp: IPv6 to binary                 ... OK
utmp: to text                        ... OK
utmp: IPv6 to text                   ... OK
uuid: uuidd                          ... OK
uuid: uuidgen                        ... OK
uuid: uuid_parser                    ... OK
wipefs: wipefs                         ... SKIPPED (no root permissions)

---------------------------------------------------------------------
1 tests of 192 FAILED
---------------------------------------------------------------------
Makefile:12346: recipe for target 'check-local-tests' failed
make[3]: *** [check-local-tests] Error 1
make[3]: Leaving directory '/tmp/util-linux-2.30-rc2.q5ov6G/util-linux-2.30-rc2'
Makefile:11985: recipe for target 'check-am' failed
make[2]: *** [check-am] Error 2
make[2]: Leaving directory '/tmp/util-linux-2.30-rc2.q5ov6G/util-linux-2.30-rc2'
Makefile:11696: recipe for target 'check-recursive' failed
make[1]: *** [check-recursive] Error 1
make[1]: Leaving directory '/tmp/util-linux-2.30-rc2.q5ov6G/util-linux-2.30-rc2'
Makefile:11989: recipe for target 'check' failed
make: *** [check] Error 2

Build information

PATH /usr/local/bin:/usr/bin
SHELL /bin/bash
PWD /tmp/util-linux-2.30-rc2.q5ov6G
hostname fedora24
SOURCE http://www.kernel.org/pub/linux/utils/util-linux/v2.30/util-linux-2.30-rc2.tar.gz
BASENAME util-linux-2.30-rc2
configure_extra_params
make_extra_params
make_check_extra_params
env_extra_params
git_branch

Build host information

autoconf-version autoconf (GNU Autoconf) 2.69
automake-version automake (GNU automake) 1.15
autopoint-version /usr/bin/autopoint (GNU gettext-tools) 0.19.8.1
autoreconf-version autoreconf (GNU Autoconf) 2.69
make-version GNU Make 4.1
makeinfo-version texi2any (GNU texinfo) 6.1
git-version git version 2.7.4
wget-version GNU Wget 1.18 built on linux-gnu.
rsync-version rsync version 3.1.2 protocol version 31
gcc-version gcc (GCC) 6.1.1 20160621 (Red Hat 6.1.1-3)
cc-version cc (GCC) 6.1.1 20160621 (Red Hat 6.1.1-3)
uname-s Linux
uname-r 4.6.3-300.fc24.x86_64
uname-m x86_64
uname-p x86_64
uname-i x86_64
uname-o GNU/Linux
uname-v #1 SMP Fri Jun 24 20:52:41 UTC 2016
lsb_release-v :core-4.1-amd64:core-4.1-noarch
lsb_release-i Fedora
lsb_release-d "Fedora release 24 (Twenty Four)"
lsb_release-r 24
lsb_release-c TwentyFour
etc_release
etc_issue \S
etc_os_release_NAME Fedora
etc_os_release_VERSION 24 (Twenty Four)
etc_os_release_ID fedora
etc_os_release_VERSION_ID 24
etc_os_release_PRETTY_NAME Fedora 24 (Twenty Four)
etc_os_release_ANSI_COLOR 0;34
etc_os_release_CPE_NAME cpe:/o:fedoraproject:fedora:24
etc_os_release_HOME_URL https://fedoraproject.org/
etc_os_release_BUG_REPORT_URL https://bugzilla.redhat.com/
etc_os_release_REDHAT_BUGZILLA_PRODUCT Fedora
etc_os_release_REDHAT_BUGZILLA_PRODUCT_VERSION 24
etc_os_release_REDHAT_SUPPORT_PRODUCT Fedora
etc_os_release_REDHAT_SUPPORT_PRODUCT_VERSION 24
etc_os_release_PRIVACY_POLICY_URL https://fedoraproject.org/wiki/Legal:PrivacyPolicy

Download Log Files

logs/timestamp.start.txt 76 Bytes curl -JLO 'http://pretest.housegordon.org/g/4841/logs/timestamp.start.txt'
logs/versions.txt 1.5 kB curl -JLO 'http://pretest.housegordon.org/g/4841/logs/versions.txt'
logs/environment.txt 99 Bytes curl -JLO 'http://pretest.housegordon.org/g/4841/logs/environment.txt'
logs/input.txt 216 Bytes curl -JLO 'http://pretest.housegordon.org/g/4841/logs/input.txt'
logs/configure.log 21.0 kB curl -JLO 'http://pretest.housegordon.org/g/4841/logs/configure.log'
logs/configure.ok 0 Bytes curl -JLO 'http://pretest.housegordon.org/g/4841/logs/configure.ok'
logs/make.log 16.1 kB curl -JLO 'http://pretest.housegordon.org/g/4841/logs/make.log'
logs/make.ok 0 Bytes curl -JLO 'http://pretest.housegordon.org/g/4841/logs/make.ok'
logs/make-check.log 37.4 kB curl -JLO 'http://pretest.housegordon.org/g/4841/logs/make-check.log'
logs/status 18 Bytes curl -JLO 'http://pretest.housegordon.org/g/4841/logs/status'
logs/config.log 293.0 kB curl -JLO 'http://pretest.housegordon.org/g/4841/logs/config.log'
logs/config.status 82.2 kB curl -JLO 'http://pretest.housegordon.org/g/4841/logs/config.status'
logs/config.h 22.7 kB curl -JLO 'http://pretest.housegordon.org/g/4841/logs/config.h'
logs/tail-error.log 3.0 kB curl -JLO 'http://pretest.housegordon.org/g/4841/logs/tail-error.log'