Pretest Build Reports - Build 4827 details

For more information see http://pretest.nongnu.org.

← back to list

Project: util-linux-2.30-rc2
Source: http://www.kernel.org/pub/linux/utils/util-linux/v2.30/util-linux-2.30-rc2.tar.gz
System: OpenBSD 6.1 (amd64)
Status:
make failed
Download logs (what's inside?) util-linux-2.30-rc2.pretest-build-report.build-4827.tar.bz2
Last lines of tail-error.log:
make failed, tail of make.log:

from lib/mbsalign.c:28:
/usr/include/unistd.h:358: warning: redundant redeclaration of 'lseek'
/usr/include/sys/types.h:204: warning: previous declaration of 'lseek' was here
/usr/include/unistd.h:394: warning: redundant redeclaration of 'ftruncate'
/usr/include/sys/types.h:205: warning: previous declaration of 'ftruncate' was here
/usr/include/unistd.h:412: warning: redundant redeclaration of 'mkstemp'
/usr/include/stdlib.h:204: warning: previous declaration of 'mkstemp' was here
/usr/include/unistd.h:413: warning: redundant redeclaration of 'mktemp'
/usr/include/stdlib.h:173: warning: previous declaration of 'mktemp' was here
/usr/include/unistd.h:419: warning: redundant redeclaration of 'truncate'
/usr/include/sys/types.h:206: warning: previous declaration of 'truncate' was here
/usr/include/unistd.h:494: warning: redundant redeclaration of 'mkdtemp'
/usr/include/stdlib.h:244: warning: previous declaration of 'mkdtemp' was here
/usr/include/unistd.h:495: warning: redundant redeclaration of 'mkstemps'
/usr/include/stdlib.h:284: warning: previous declaration of 'mkstemps' was here
In file included from lib/mbsalign.c:30:
./include/strutils.h:40: warning: 'struct timeval' declared inside parameter list
./include/strutils.h:40: warning: its scope is only this definition or declaration, which is probably not what you want
CC       lib/libcommon_la-mbsedit.lo
CC       lib/libcommon_la-md5.lo
CC       lib/libcommon_la-pager.lo
In file included from lib/pager.c:8:
/usr/include/unistd.h:358: warning: redundant redeclaration of 'lseek'
/usr/include/sys/types.h:204: warning: previous declaration of 'lseek' was here
/usr/include/unistd.h:394: warning: redundant redeclaration of 'ftruncate'
/usr/include/sys/types.h:205: warning: previous declaration of 'ftruncate' was here
/usr/include/unistd.h:419: warning: redundant redeclaration of 'truncate'
/usr/include/sys/types.h:206: warning: previous declaration of 'truncate' was here
In file included from lib/pager.c:9:
/usr/include/stdlib.h:173: warning: redundant redeclaration of 'mktemp'
/usr/include/unistd.h:413: warning: previous declaration of 'mktemp' was here
/usr/include/stdlib.h:204: warning: redundant redeclaration of 'mkstemp'
/usr/include/unistd.h:412: warning: previous declaration of 'mkstemp' was here
/usr/include/stdlib.h:244: warning: redundant redeclaration of 'mkdtemp'
/usr/include/unistd.h:494: warning: previous declaration of 'mkdtemp' was here
/usr/include/stdlib.h:284: warning: redundant redeclaration of 'mkstemps'
/usr/include/unistd.h:495: warning: previous declaration of 'mkstemps' was here
In file included from ./include/c.h:16,
from lib/pager.c:17:
/usr/include/errno.h:54: warning: redundant redeclaration of '__errno'
/usr/include/signal.h:72: warning: previous declaration of '__errno' was here
In file included from lib/pager.c:20:
./include/ttyutils.h: In function 'reset_virtual_console':
./include/ttyutils.h:119: error: 'TAB0' undeclared (first use in this function)
./include/ttyutils.h:119: error: (Each undeclared identifier is reported only once
./include/ttyutils.h:119: error: for each function it appears in.)
./include/ttyutils.h:120: error: 'TABDLY' undeclared (first use in this function)
*** Error 1 in . (Makefile:8389 'lib/libcommon_la-pager.lo': @echo "  CC      " lib/libcommon_la-pager.lo;/bin/sh ./libtool --silent --tag=C...)
*** Error 1 in . (Makefile:11721 'all-recursive')
*** Error 1 in /tmp/util-linux-2.30-rc2.JEjyAL/util-linux-2.30-rc2 (Makefile:4891 'all')

Build information

PATH /usr/bin:/bin:/usr/sbin:/sbin:/usr/X11R6/bin:/usr/local/bin:/usr/local/sbin
SHELL /bin/ksh
PWD /tmp/util-linux-2.30-rc2.JEjyAL
hostname obsd61.my.domain
SOURCE http://www.kernel.org/pub/linux/utils/util-linux/v2.30/util-linux-2.30-rc2.tar.gz
BASENAME util-linux-2.30-rc2
configure_extra_params
make_extra_params
make_check_extra_params
env_extra_params
git_branch

Build host information

autoconf-version no-version
automake-version no-version
autopoint-version missing
autoreconf-version no-version
make-version no-version
makeinfo-version makeinfo (GNU texinfo) 4.8
git-version git version 2.12.2
wget-version GNU Wget 1.19.1 built on openbsd6.1.
rsync-version rsync version 3.1.2 protocol version 31
gcc-version gcc (GCC) 4.2.1 20070719
cc-version cc (GCC) 4.2.1 20070719
uname-s OpenBSD
uname-r 6.1
uname-m amd64
uname-p amd64
uname-i
uname-o
uname-v GENERIC#19
lsb_release-v
lsb_release-i
lsb_release-d
lsb_release-r
lsb_release-c
etc_release
etc_issue

Download Log Files

logs/timestamp.start.txt 76 Bytes curl -JLO 'http://pretest.housegordon.org/g/4827/logs/timestamp.start.txt'
logs/versions.txt 603 Bytes curl -JLO 'http://pretest.housegordon.org/g/4827/logs/versions.txt'
logs/environment.txt 158 Bytes curl -JLO 'http://pretest.housegordon.org/g/4827/logs/environment.txt'
logs/input.txt 216 Bytes curl -JLO 'http://pretest.housegordon.org/g/4827/logs/input.txt'
logs/configure.log 24.5 kB curl -JLO 'http://pretest.housegordon.org/g/4827/logs/configure.log'
logs/configure.ok 0 Bytes curl -JLO 'http://pretest.housegordon.org/g/4827/logs/configure.ok'
logs/make.log 13.4 kB curl -JLO 'http://pretest.housegordon.org/g/4827/logs/make.log'
logs/status 12 Bytes curl -JLO 'http://pretest.housegordon.org/g/4827/logs/status'
logs/config.log 433.4 kB curl -JLO 'http://pretest.housegordon.org/g/4827/logs/config.log'
logs/config.status 79.9 kB curl -JLO 'http://pretest.housegordon.org/g/4827/logs/config.status'
logs/config.h 22.9 kB curl -JLO 'http://pretest.housegordon.org/g/4827/logs/config.h'
logs/tail-error.log 3.6 kB curl -JLO 'http://pretest.housegordon.org/g/4827/logs/tail-error.log'