Pretest Build Reports - Build 4821 details

For more information see http://pretest.nongnu.org.

← back to list

Project: util-linux-2.30-rc2
Source: http://www.kernel.org/pub/linux/utils/util-linux/v2.30/util-linux-2.30-rc2.tar.gz
System: Ubuntu 14.04 (x86_64,CC=tcc)
Status:
make failed
Download logs (what's inside?) util-linux-2.30-rc2.pretest-build-report.build-4821.tar.bz2
Last lines of tail-error.log:
make failed, tail of make.log:

CCLD     findmnt
CC       misc-utils/kill.o
CCLD     kill
CC       term-utils/agetty.o
CCLD     agetty
CC       login-utils/sulogin.o
CC       login-utils/sulogin-consoles.o
CCLD     sulogin
CC       login-utils/nologin.o
CCLD     nologin
CC       sys-utils/fstrim-fstrim.o
CCLD     fstrim
CC       sys-utils/ctrlaltdel.o
CCLD     ctrlaltdel
CC       sys-utils/fsfreeze.o
CCLD     fsfreeze
CC       sys-utils/blkdiscard.o
CC       lib/monotonic.o
CCLD     blkdiscard
CC       sys-utils/losetup-losetup.o
CCLD     losetup
CC       sys-utils/zramctl-zramctl.o
CCLD     zramctl
CC       sys-utils/swapon-swapon.o
CC       sys-utils/swapon-swapon-common.o
CC       lib/swapon-swapprober.o
CCLD     swapon
CC       sys-utils/swapoff-swapoff.o
CC       sys-utils/swapoff-swapon-common.o
CC       lib/swapoff-swapprober.o
CCLD     swapoff
CC       sys-utils/chcpu.o
CCLD     chcpu
CC       sys-utils/pivot_root.o
CCLD     pivot_root
CC       sys-utils/switch_root.o
CCLD     switch_root
CC       sys-utils/hwclock.o
CC       sys-utils/hwclock-cmos.o
sys-utils/hwclock-cmos.c:139: warning: implicit declaration of function 'outb'
sys-utils/hwclock-cmos.c:140: warning: implicit declaration of function 'inb'
CC       sys-utils/hwclock-rtc.o
CCLD     hwclock
tcc: error: undefined symbol 'outb'
tcc: error: undefined symbol 'inb'
make[2]: *** [hwclock] Error 1
make[2]: Leaving directory `/tmp/util-linux-2.30-rc2.Ai4AiQ/util-linux-2.30-rc2'
make[1]: *** [all-recursive] Error 1
make[1]: Leaving directory `/tmp/util-linux-2.30-rc2.Ai4AiQ/util-linux-2.30-rc2'
make: *** [all] Error 2

Build information

PATH /usr/local/bin:/sbin:/usr/sbin:/bin:/usr/bin
SHELL
PWD /tmp/util-linux-2.30-rc2.Ai4AiQ
hostname jitterbug.erlich.nygenome.org
SOURCE http://www.kernel.org/pub/linux/utils/util-linux/v2.30/util-linux-2.30-rc2.tar.gz
BASENAME util-linux-2.30-rc2
configure_extra_params CC=tcc CXX=XXX
make_extra_params
make_check_extra_params
env_extra_params
git_branch

Build host information

autoconf-version autoconf (GNU Autoconf) 2.69
automake-version automake (GNU automake) 1.14.1
autopoint-version /usr/local/bin/autopoint (GNU gettext-tools) 0.19.4
autoreconf-version autoreconf (GNU Autoconf) 2.69
make-version GNU Make 3.81
makeinfo-version texi2any (GNU texinfo) 6.3
git-version git version 1.9.1
wget-version GNU Wget 1.15 built on linux-gnu.
rsync-version rsync version 3.1.0 protocol version 31
gcc-version gcc (Ubuntu 4.8.4-2ubuntu1~14.04.3) 4.8.4
cc-version cc (Ubuntu 4.8.4-2ubuntu1~14.04.3) 4.8.4
uname-s Linux
uname-r 3.13.0-117-generic
uname-m x86_64
uname-p unknown
uname-i unknown
uname-o GNU/Linux
uname-v #164-Ubuntu SMP Fri Apr 7 11:05:26 UTC 2017
lsb_release-v
lsb_release-i Ubuntu
lsb_release-d Ubuntu 14.04.5 LTS
lsb_release-r 14.04
lsb_release-c trusty
etc_release
etc_issue Ubuntu 14.04.5 LTS \n \l
etc_os_release_NAME Ubuntu
etc_os_release_VERSION 14.04.5 LTS, Trusty Tahr
etc_os_release_ID ubuntu
etc_os_release_ID_LIKE debian
etc_os_release_PRETTY_NAME Ubuntu 14.04.5 LTS
etc_os_release_VERSION_ID 14.04
etc_os_release_HOME_URL http://www.ubuntu.com/
etc_os_release_SUPPORT_URL http://help.ubuntu.com/
etc_os_release_BUG_REPORT_URL http://bugs.launchpad.net/ubuntu/

Download Log Files

logs/configure.ok 0 Bytes curl -JLO 'http://pretest.housegordon.org/g/4821/logs/configure.ok'
logs/input.txt 231 Bytes curl -JLO 'http://pretest.housegordon.org/g/4821/logs/input.txt'
logs/make.log 11.7 kB curl -JLO 'http://pretest.housegordon.org/g/4821/logs/make.log'
logs/tail-error.log 1.7 kB curl -JLO 'http://pretest.housegordon.org/g/4821/logs/tail-error.log'
logs/status 12 Bytes curl -JLO 'http://pretest.housegordon.org/g/4821/logs/status'
logs/config.h 22.7 kB curl -JLO 'http://pretest.housegordon.org/g/4821/logs/config.h'
logs/environment.txt 132 Bytes curl -JLO 'http://pretest.housegordon.org/g/4821/logs/environment.txt'
logs/versions.txt 1.2 kB curl -JLO 'http://pretest.housegordon.org/g/4821/logs/versions.txt'
logs/config.status 82.7 kB curl -JLO 'http://pretest.housegordon.org/g/4821/logs/config.status'
logs/config.log 253.0 kB curl -JLO 'http://pretest.housegordon.org/g/4821/logs/config.log'
logs/configure.log 21.1 kB curl -JLO 'http://pretest.housegordon.org/g/4821/logs/configure.log'
logs/timestamp.start.txt 76 Bytes curl -JLO 'http://pretest.housegordon.org/g/4821/logs/timestamp.start.txt'