Pretest Build Reports - Build 4816 details

For more information see http://pretest.nongnu.org.

← back to list

Project: util-linux-2.30-rc2
Source: http://www.kernel.org/pub/linux/utils/util-linux/v2.30/util-linux-2.30-rc2.tar.gz
System: Darwin 15.6.0 (x86_64)
Status:
make failed
Download logs (what's inside?) util-linux-2.30-rc2.pretest-build-report.build-4816.tar.bz2
Last lines of tail-error.log:
make failed, tail of make.log:

CC       text-utils/column-column.o
CCLD     column
CC       text-utils/hexdump-conv.o
CC       text-utils/hexdump-display.o
CC       text-utils/hexdump.o
CC       text-utils/hexdump-parse.o
CCLD     hexdump
CC       text-utils/rev.o
CCLD     rev
CC       text-utils/ul-ul.o
CCLD     ul
CC       term-utils/scriptreplay.o
CCLD     scriptreplay
CC       term-utils/mesg.o
CCLD     mesg
CC       term-utils/wall-wall.o
term-utils/wall.c:153:39: warning: passing 'gid_t *const' (aka 'unsigned int *const') to parameter of type 'int *' converts between pointers to integer types with different sign [-Wpointer-sign]
rc = getgrouplist(login, pw->pw_gid, buf->groups, &ngroups);
^~~~~~~~~~~
/usr/include/unistd.h:653:43: note: passing argument to parameter here
int      getgrouplist(const char *, int, int *, int *);
^
1 warning generated.
CC       term-utils/wall-ttymsg.o
CCLD     wall
CC       sys-utils/ipcmk.o
CCLD     ipcmk
CC       sys-utils/ipcrm.o
sys-utils/ipcrm.c:246:17: error: variable has incomplete type 'struct seminfo'
struct seminfo seminfo;
^
sys-utils/ipcrm.c:246:9: note: forward declaration of 'struct seminfo'
struct seminfo seminfo;
^
sys-utils/ipcrm.c:253:21: error: use of undeclared identifier 'SHM_INFO'
maxid = shmctl(0, SHM_INFO, &shmseg);
^
sys-utils/ipcrm.c:258:23: error: use of undeclared identifier 'SHM_STAT'
rm_me = shmctl(id, SHM_STAT, &shmseg);
^
sys-utils/ipcrm.c:266:24: error: use of undeclared identifier 'SEM_INFO'
maxid = semctl(0, 0, SEM_INFO, arg);
^
sys-utils/ipcrm.c:272:26: error: use of undeclared identifier 'SEM_STAT'
rm_me = semctl(id, 0, SEM_STAT, arg);
^
5 errors generated.
make[2]: *** [sys-utils/ipcrm.o] Error 1
make[1]: *** [all-recursive] Error 1
make: *** [all] Error 2

Build information

PATH /Users/travis/.rvm/gems/ruby-2.0.0-p648/bin:/Users/travis/.rvm/gems/ruby-2.0.0-p648@global/bin:/Users/travis/.rvm/rubies/ruby-2.0.0-p648/bin:/Users/travis/.rvm/bin:/Users/travis/bin:/Users/travis/.local/bin:/Users/travis/.nvm/versions/node/v6.0.0/bin:/usr/local/bin:/usr/bin:/bin:/usr/sbin:/sbin:/opt/X11/bin
SHELL /bin/bash
PWD /var/folders/my/m6ynh3bn6tq06h7xr3js0z7r0000gn/T/util-linux-2.30-rc2.XXXXXX.Uv4LHKM1
hostname Traviss-Mac-1220.local
SOURCE http://www.kernel.org/pub/linux/utils/util-linux/v2.30/util-linux-2.30-rc2.tar.gz
BASENAME util-linux-2.30-rc2
configure_extra_params
make_extra_params
make_check_extra_params
env_extra_params
git_branch

Build host information

autoconf-version autoconf (GNU Autoconf) 2.69
automake-version automake (GNU automake) 1.15
autopoint-version missing
autoreconf-version autoreconf (GNU Autoconf) 2.69
make-version GNU Make 3.81
makeinfo-version makeinfo (GNU texinfo) 4.8
git-version git version 2.10.0
wget-version GNU Wget 1.18 built on darwin15.5.0.
rsync-version rsync version 2.6.9 protocol version 29
gcc-version Apple LLVM version 7.3.0 (clang-703.0.31)
cc-version Apple LLVM version 7.3.0 (clang-703.0.31)
uname-s Darwin
uname-r 15.6.0
uname-m x86_64
uname-p i386
uname-i
uname-o
uname-v Darwin Kernel Version 15.6.0: Mon Aug 29 20:21:34 PDT 2016; root:xnu-3248.60.11~1/RELEASE_X86_64
lsb_release-v
lsb_release-i
lsb_release-d
lsb_release-r
lsb_release-c
etc_release
etc_issue

Download Log Files

logs/config.h 22.9 kB curl -JLO 'http://pretest.housegordon.org/g/4816/logs/config.h'
logs/config.log 490.2 kB curl -JLO 'http://pretest.housegordon.org/g/4816/logs/config.log'
logs/config.status 81.5 kB curl -JLO 'http://pretest.housegordon.org/g/4816/logs/config.status'
logs/configure.log 25.2 kB curl -JLO 'http://pretest.housegordon.org/g/4816/logs/configure.log'
logs/configure.ok 0 Bytes curl -JLO 'http://pretest.housegordon.org/g/4816/logs/configure.ok'
logs/environment.txt 451 Bytes curl -JLO 'http://pretest.housegordon.org/g/4816/logs/environment.txt'
logs/input.txt 216 Bytes curl -JLO 'http://pretest.housegordon.org/g/4816/logs/input.txt'
logs/make.log 11.9 kB curl -JLO 'http://pretest.housegordon.org/g/4816/logs/make.log'
logs/status 12 Bytes curl -JLO 'http://pretest.housegordon.org/g/4816/logs/status'
logs/tail-error.log 2.2 kB curl -JLO 'http://pretest.housegordon.org/g/4816/logs/tail-error.log'
logs/timestamp.start.txt 76 Bytes curl -JLO 'http://pretest.housegordon.org/g/4816/logs/timestamp.start.txt'
logs/versions.txt 783 Bytes curl -JLO 'http://pretest.housegordon.org/g/4816/logs/versions.txt'