Pretest Build Reports - Build 4811 details

For more information see http://pretest.nongnu.org.

← back to list

Project: util-linux-2.30-rc2
Source: http://www.kernel.org/pub/linux/utils/util-linux/v2.30/util-linux-2.30-rc2.tar.gz
System: Ubuntu 14.04 (x86_64,CC=clang-4.0)
Status:
make-check failed
Download logs (what's inside?) util-linux-2.30-rc2.pretest-build-report.build-4811.tar.bz2
Last lines of tail-error.log:
make-check failed, tail of make-check.log:

script: options: [02] force                           ... OK
script: options: [03] quiet                           ... OK
script: options: [04] return                          ... OK
script: options                                       ... OK (all 4 sub-tests PASSED)
script: replay                                        ... OK
sfdisk: MBR                                           ... SKIPPED (no root permissions)
sfdisk: GPT                                           ... SKIPPED (no root permissions)
sfdisk: movedata                                      ... SKIPPED (no root permissions)
sfdisk: resize                                        ... SKIPPED (no root permissions)
sfdisk: GPT                                           ... SKIPPED (no root permissions)
sfdisk: wipe                                          ... SKIPPED (no root permissions)
swapon: by devname                                    ... SKIPPED (no root permissions)
swapon: fix page size                                 ... SKIPPED (no root permissions)
swapon: fix signature                                 ... SKIPPED (no root permissions)
swapon: by label                                      ... SKIPPED (no root permissions)
swapon: by uuid                                       ... SKIPPED (no root permissions)
utmp: last: [01] dns                                ... OK
utmp: last: [02] nodns                              ... OK
utmp: last                                          ... OK (all 2 sub-tests PASSED)
utmp: last ipv6: [01] dns                           ... OK
utmp: last ipv6: [02] nodns                         ... OK
utmp: last ipv6                                     ... OK (all 2 sub-tests PASSED)
utmp: circle                                        ... OK
utmp: subsecond                                     ... OK
utmp: to binary                                     ... OK
utmp: IPv6 to binary                                ... OK
utmp: to text                                       ... OK
utmp: IPv6 to text                                  ... OK
uuid: uuidd                                         ... OK
uuid: uuidgen                                       ... OK
uuid: uuid_parser                                   ... OK
wipefs: wipefs                                        ... SKIPPED (no root permissions)
script: race conditions                               ... OK
minix: mkfs fsck                                     ... OK
/tmp/util-linux-2.30-rc2.J6tCwJ/util-linux-2.30-rc2/tests/ts/logger/formats: line 39:  7055 Terminated              $TS_HELPER_LOGGER -u $DEVLOG -s --no-act "$@" >> "$TS_OUTPUT" 2>&1
logger: formats: [07] priorities                      ... FAILED (logger/formats-priorities)
/tmp/util-linux-2.30-rc2.J6tCwJ/util-linux-2.30-rc2/tests/ts/logger/formats: line 79: kill: (6444) - No such process
logger: formats: [08] check_socket                    ... OK
logger: formats                                       ... FAILED (1 from 8 sub-tests)

---------------------------------------------------------------------
1 tests of 192 FAILED
---------------------------------------------------------------------
make[3]: *** [check-local-tests] Error 1
make[3]: Leaving directory `/tmp/util-linux-2.30-rc2.J6tCwJ/util-linux-2.30-rc2'
make[2]: *** [check-am] Error 2
make[2]: Leaving directory `/tmp/util-linux-2.30-rc2.J6tCwJ/util-linux-2.30-rc2'
make[1]: *** [check-recursive] Error 1
make[1]: Leaving directory `/tmp/util-linux-2.30-rc2.J6tCwJ/util-linux-2.30-rc2'
make: *** [check] Error 2

Build information

PATH /usr/local/bin:/sbin:/usr/sbin:/bin:/usr/bin
SHELL
PWD /tmp/util-linux-2.30-rc2.J6tCwJ
hostname jitterbug.erlich.nygenome.org
SOURCE http://www.kernel.org/pub/linux/utils/util-linux/v2.30/util-linux-2.30-rc2.tar.gz
BASENAME util-linux-2.30-rc2
configure_extra_params CC=clang-4.0 CXX=clang++-4.0
make_extra_params
make_check_extra_params
env_extra_params
git_branch

Build host information

autoconf-version autoconf (GNU Autoconf) 2.69
automake-version automake (GNU automake) 1.14.1
autopoint-version /usr/local/bin/autopoint (GNU gettext-tools) 0.19.4
autoreconf-version autoreconf (GNU Autoconf) 2.69
make-version GNU Make 3.81
makeinfo-version texi2any (GNU texinfo) 6.3
git-version git version 1.9.1
wget-version GNU Wget 1.15 built on linux-gnu.
rsync-version rsync version 3.1.0 protocol version 31
gcc-version gcc (Ubuntu 4.8.4-2ubuntu1~14.04.3) 4.8.4
cc-version cc (Ubuntu 4.8.4-2ubuntu1~14.04.3) 4.8.4
uname-s Linux
uname-r 3.13.0-117-generic
uname-m x86_64
uname-p unknown
uname-i unknown
uname-o GNU/Linux
uname-v #164-Ubuntu SMP Fri Apr 7 11:05:26 UTC 2017
lsb_release-v
lsb_release-i Ubuntu
lsb_release-d Ubuntu 14.04.5 LTS
lsb_release-r 14.04
lsb_release-c trusty
etc_release
etc_issue Ubuntu 14.04.5 LTS \n \l
etc_os_release_NAME Ubuntu
etc_os_release_VERSION 14.04.5 LTS, Trusty Tahr
etc_os_release_ID ubuntu
etc_os_release_ID_LIKE debian
etc_os_release_PRETTY_NAME Ubuntu 14.04.5 LTS
etc_os_release_VERSION_ID 14.04
etc_os_release_HOME_URL http://www.ubuntu.com/
etc_os_release_SUPPORT_URL http://help.ubuntu.com/
etc_os_release_BUG_REPORT_URL http://bugs.launchpad.net/ubuntu/

Download Log Files

logs/make-check.log 49.3 kB curl -JLO 'http://pretest.housegordon.org/g/4811/logs/make-check.log'
logs/configure.ok 0 Bytes curl -JLO 'http://pretest.housegordon.org/g/4811/logs/configure.ok'
logs/input.txt 245 Bytes curl -JLO 'http://pretest.housegordon.org/g/4811/logs/input.txt'
logs/make.log 22.5 kB curl -JLO 'http://pretest.housegordon.org/g/4811/logs/make.log'
logs/tail-error.log 3.9 kB curl -JLO 'http://pretest.housegordon.org/g/4811/logs/tail-error.log'
logs/status 18 Bytes curl -JLO 'http://pretest.housegordon.org/g/4811/logs/status'
logs/config.h 22.7 kB curl -JLO 'http://pretest.housegordon.org/g/4811/logs/config.h'
logs/environment.txt 132 Bytes curl -JLO 'http://pretest.housegordon.org/g/4811/logs/environment.txt'
logs/versions.txt 1.2 kB curl -JLO 'http://pretest.housegordon.org/g/4811/logs/versions.txt'
logs/config.status 82.9 kB curl -JLO 'http://pretest.housegordon.org/g/4811/logs/config.status'
logs/config.log 269.4 kB curl -JLO 'http://pretest.housegordon.org/g/4811/logs/config.log'
logs/make.ok 0 Bytes curl -JLO 'http://pretest.housegordon.org/g/4811/logs/make.ok'
logs/configure.log 21.3 kB curl -JLO 'http://pretest.housegordon.org/g/4811/logs/configure.log'
logs/timestamp.start.txt 76 Bytes curl -JLO 'http://pretest.housegordon.org/g/4811/logs/timestamp.start.txt'